BDBM332035 (E)-N'-[(3-ethoxy-2- hydroxybenzal)methylene]- 2-{N-{2-[N-(4- isopropylbenzyl)-N- methylamino]ethyl}N- methylamino}acethydrazide::US10196346, Example 13
SMILES: CCOc1cccc(\C=N\NC(=O)CN(C)CCN(C)Cc2ccc(cc2)C(C)C)c1O
InChI Key: InChIKey=RQWVYEXWGNFYTO-WGOQTCKBSA-N
Data: 1 EC50
Activity Spreadsheet -- Enzyme Inhibition Constant Data from BindingDB
Found 1 hit for monomerid = 332035
Trg + Lig
Ki
nM
ΔG°
kcal/mole
IC50
nM
Kd
nM
EC50/IC50
nM
koff
s-1
kon
M-1s-1
pHTemp
°C
Hypoxia-inducible factor 1-alpha
(Homo sapiens (Human))
BDBM332035
((E)-N'-[(3-ethoxy-2- hydroxybenzal)methylene]- 2-{...)
Show SMILES CCOc1cccc(\C=N\NC(=O)CN(C)CCN(C)Cc2ccc(cc2)C(C)C)c1O
Show InChI InChI=1S/C25H36N4O3/c1-6-32-23-9-7-8-22(25(23)31)16-26-27-24(30)18-29(5)15-14-28(4)17-20-10-12-21(13-11-20)19(2)3/h7-13,16,19,31H,6,14-15,17-18H2,1-5H3,(H,27,30)/b26-16+
Reactome pathway
US Patent
n/an/an/an/a 800n/an/an/an/a
Institute of Pharmacology and Toxicology Academy of Military Medical Sciences P.L.A. China
US Patent
Assay Description
The compounds were formulated with DMSO to form 30 mM stock solutions, and then formulated with analytical nutrient solution to form 2× working solut...
US Patent US10196346 (2019)
BindingDB Entry DOI: 10.7270/Q2VQ34SQ