null
SMILES: CCN(CC)c1ccc(\C=N\NC(=O)CN(C)CCCN(C)Cc2ccc(cc2)C(C)(C)C)c(O)c1
InChI Key: InChIKey=KRQRRYHIGHSVKT-TWKHWXDSSA-N
Activity Spreadsheet -- Enzyme Inhibition Constant Data from BindingDB
Found 1 hit for monomerid = 332051
Trg + Lig
Ki
nM
ΔG°
kcal/mole
IC50
nM
Kd
nM
EC50/IC50
nM
koff
s-1
kon
M-1s-1
pHTemp
°C
Hypoxia-inducible factor 1-alpha
(Homo sapiens (Human))
BDBM332051
((E)-N'-(4-N,N-diethylamino- 2-hydroxybenzal)-2-{N-...)
Show SMILES CCN(CC)c1ccc(\C=N\NC(=O)CN(C)CCCN(C)Cc2ccc(cc2)C(C)(C)C)c(O)c1
Show InChI InChI=1S/C29H45N5O2/c1-8-34(9-2)26-16-13-24(27(35)19-26)20-30-31-28(36)22-33(7)18-10-17-32(6)21-23-11-14-25(15-12-23)29(3,4)5/h11-16,19-20,35H,8-10,17-18,21-22H2,1-7H3,(H,31,36)/b30-20+
Reactome pathway
US Patent
n/an/an/an/a 130n/an/an/an/a
Institute of Pharmacology and Toxicology Academy of Military Medical Sciences P.L.A. China
US Patent
Assay Description
The compounds were formulated with DMSO to form 30 mM stock solutions, and then formulated with analytical nutrient solution to form 2× working solut...
US Patent US10196346 (2019)
BindingDB Entry DOI: 10.7270/Q2VQ34SQ