BDBM33240 thieno[2,3-d]pyrimidine, 34g
SMILES: CCNC(=O)c1cc2c(nc(N)nc2s1)-c1cc(OCC(N)=O)c(Cl)cc1Cl
InChI Key: InChIKey=FXDPYZMMXPTNNY-UHFFFAOYSA-N
Data: 1 IC50
Activity Spreadsheet -- Enzyme Inhibition Constant Data from BindingDB
Found 1 hit for monomerid = 33240
Trg + Lig
Ki
nM
ΔG°
kcal/mole
IC50
nM
Kd
nM
EC50/IC50
nM
koff
s-1
kon
M-1s-1
pHTemp
°C
Heat shock protein HSP 90-beta
(Homo sapiens (Human))
BDBM33240
(thieno[2,3-d]pyrimidine, 34g)
Show SMILES CCNC(=O)c1cc2c(nc(N)nc2s1)-c1cc(OCC(N)=O)c(Cl)cc1Cl
Show InChI InChI=1S/C17H15Cl2N5O3S/c1-2-22-15(26)12-4-8-14(23-17(21)24-16(8)28-12)7-3-11(27-6-13(20)25)10(19)5-9(7)18/h3-5H,2,6H2,1H3,(H2,20,25)(H,22,26)(H2,21,23,24)
Reactome pathway
n/an/a 29n/an/an/an/a7.423
Vernalis (R&D) Ltd
Assay Description
The assay is based upon displacement of a fluorescently labeled molecule, which binds specifically to the ATP-binding site of full-length human Hsp90...
J Med Chem 52: 4794-809 (2009)
Article DOI: 10.1021/jm900357y
BindingDB Entry DOI: 10.7270/Q2445JVZ