null
SMILES: Cc1cccc(c1)C(=O)N1CC2(C1)CCN(CC2)C(=O)\C=C\c1ccc(Br)cc1
InChI Key: InChIKey=HOORJSDSSDULSE-JXMROGBWSA-N
Activity Spreadsheet -- Enzyme Inhibition Constant Data from BindingDB
Found 1 hit for monomerid = 332557
Trg + Lig
Ki
nM
ΔG°
kcal/mole
IC50
nM
Kd
nM
EC50/IC50
nM
koff
s-1
kon
M-1s-1
pHTemp
°C
G-protein coupled receptor 183
(Homo sapiens (Human))
BDBM332557
((2E)-3-(4-bromophenyl)-1-{2-[(3-methylphenyl)carbo...)
Show SMILES Cc1cccc(c1)C(=O)N1CC2(C1)CCN(CC2)C(=O)\C=C\c1ccc(Br)cc1
Show InChI InChI=1S/C24H25BrN2O2/c1-18-3-2-4-20(15-18)23(29)27-16-24(17-27)11-13-26(14-12-24)22(28)10-7-19-5-8-21(25)9-6-19/h2-10,15H,11-14,16-17H2,1H3/b10-7+
US Patent
n/an/a<5n/an/an/an/an/an/a
SANFORD BURNHAM PREBYS MEDICAL DISCOVERY INSTITUTE
US Patent
Assay Description
The test compounds that demonstrated a corrected % activity of >=50% were defined as inhibitors of the reaction. The experimental values were normali...
US Patent US10196369 (2019)
BindingDB Entry DOI: 10.7270/Q2BR8V88