BDBM332563 5-chloroindol-2-yl 7-{[3-fluoro-4-(trifluoromethyl)phenyl]carbonyl}-2,7-diazaspiro[3.5]non-2-yl ketone::US10196369, Compound C18
SMILES: Fc1cc(ccc1C(F)(F)F)C(=O)N1CCC2(CN(C2)C(=O)c2cc3cc(Cl)ccc3[nH]2)CC1
InChI Key: InChIKey=FWKPEANJUWZUBD-UHFFFAOYSA-N
Data: 1 IC50
Activity Spreadsheet -- Enzyme Inhibition Constant Data from BindingDB
Found 1 hit for monomerid = 332563
Trg + Lig
Ki
nM
ΔG°
kcal/mole
IC50
nM
Kd
nM
EC50/IC50
nM
koff
s-1
kon
M-1s-1
pHTemp
°C
G-protein coupled receptor 183
(Homo sapiens (Human))
BDBM332563
(5-chloroindol-2-yl 7-{[3-fluoro-4-(trifluoromethyl...)
Show SMILES Fc1cc(ccc1C(F)(F)F)C(=O)N1CCC2(CN(C2)C(=O)c2cc3cc(Cl)ccc3[nH]2)CC1
Show InChI InChI=1S/C24H20ClF4N3O2/c25-16-2-4-19-15(9-16)11-20(30-19)22(34)32-12-23(13-32)5-7-31(8-6-23)21(33)14-1-3-17(18(26)10-14)24(27,28)29/h1-4,9-11,30H,5-8,12-13H2
US Patent
n/an/a<5n/an/an/an/an/an/a
SANFORD BURNHAM PREBYS MEDICAL DISCOVERY INSTITUTE
US Patent
Assay Description
The test compounds that demonstrated a corrected % activity of >=50% were defined as inhibitors of the reaction. The experimental values were normali...
US Patent US10196369 (2019)
BindingDB Entry DOI: 10.7270/Q2BR8V88