null
SMILES: Fc1ccc(cc1)C#CC(=O)N1CCC2(CN(C2)C(=O)c2ccc(Cl)cc2)CC1
InChI Key: InChIKey=PALGKFOMWDKOQF-UHFFFAOYSA-N
Activity Spreadsheet -- Enzyme Inhibition Constant Data from BindingDB
Found 1 hit for monomerid = 332632
Trg + Lig
Ki
nM
ΔG°
kcal/mole
IC50
nM
Kd
nM
EC50/IC50
nM
koff
s-1
kon
M-1s-1
pHTemp
°C
G-protein coupled receptor 183
(Homo sapiens (Human))
BDBM332632
(1-{2-[(4-chlorophenyl)carbonyl]-2,7-diazaspiro[3.5...)
Show SMILES Fc1ccc(cc1)C#CC(=O)N1CCC2(CN(C2)C(=O)c2ccc(Cl)cc2)CC1
Show InChI InChI=1S/C23H20ClFN2O2/c24-19-6-4-18(5-7-19)22(29)27-15-23(16-27)11-13-26(14-12-23)21(28)10-3-17-1-8-20(25)9-2-17/h1-2,4-9H,11-16H2
US Patent
n/an/a<5n/an/an/an/an/an/a
SANFORD BURNHAM PREBYS MEDICAL DISCOVERY INSTITUTE
US Patent
Assay Description
The test compounds that demonstrated a corrected % activity of >=50% were defined as inhibitors of the reaction. The experimental values were normali...
US Patent US10196369 (2019)
BindingDB Entry DOI: 10.7270/Q2BR8V88