null
SMILES: [#6]-c1ccc(cc1)-[#6](=[#7]\[#7]=[#6](\[#7])-[#7])-[#15](-[#8])-[#8]
InChI Key: InChIKey=XLOPXKAWULMNPP-UHFFFAOYSA-N
Activity Spreadsheet -- Enzyme Inhibition Constant Data from BindingDB
Found 3 hits for monomerid = 33265
Trg + Lig
Ki
nM
ΔG°
kcal/mole
IC50
nM
Kd
nM
EC50/IC50
nM
koff
s-1
kon
M-1s-1
pHTemp
°C
Serine protease 1
(Bos taurus (bovine))
BDBM33265
(guanidine, 5)
Show SMILES [#6]-c1ccc(cc1)-[#6](=[#7]\[#7]=[#6](\[#7])-[#7])-[#15](-[#8])-[#8] |w:8.9|
Show InChI InChI=1S/C9H13N4O2P/c1-6-2-4-7(5-3-6)8(16(14)15)12-13-9(10)11/h2-5,14-15H,1H3,(H4,10,11,13)
3.20E+3 -7.44n/an/an/an/an/a7.623
University of Alabama at Birmingham
Assay Description
All proteases were assayed by monitoring the cleavage of peptide substrate with fluorescent reporter at room temperature with a microtiter plate spec...
Bioorg Med Chem 13: 257-64 (2005)
Article DOI: 10.1016/j.bmc.2004.09.036
BindingDB Entry DOI: 10.7270/Q2QV3JVQ
Genome polyprotein [1424-1463]/[1502-1685]
(West Nile virus (WNV))
BDBM33265
(guanidine, 5)
Show SMILES [#6]-c1ccc(cc1)-[#6](=[#7]\[#7]=[#6](\[#7])-[#7])-[#15](-[#8])-[#8] |w:8.9|
Show InChI InChI=1S/C9H13N4O2P/c1-6-2-4-7(5-3-6)8(16(14)15)12-13-9(10)11/h2-5,14-15H,1H3,(H4,10,11,13)
1.30E+4 -6.62n/an/an/an/an/a8.523
University of Alabama at Birmingham
Assay Description
All proteases were assayed by monitoring the cleavage of peptide substrate with fluorescent reporter at room temperature with a microtiter plate spec...
Bioorg Med Chem 13: 257-64 (2005)
Article DOI: 10.1016/j.bmc.2004.09.036
BindingDB Entry DOI: 10.7270/Q2QV3JVQ
Genome polyprotein [1066-1250,R1182K]/[1394-1440,K1405R,D1408E]
(Dengue virus 2 (strain TSV01))
BDBM33265
(guanidine, 5)
Show SMILES [#6]-c1ccc(cc1)-[#6](=[#7]\[#7]=[#6](\[#7])-[#7])-[#15](-[#8])-[#8] |w:8.9|
Show InChI InChI=1S/C9H13N4O2P/c1-6-2-4-7(5-3-6)8(16(14)15)12-13-9(10)11/h2-5,14-15H,1H3,(H4,10,11,13)
1.40E+4 -6.57n/an/an/an/an/a8.523
University of Alabama at Birmingham
Assay Description
All proteases were assayed by monitoring the cleavage of peptide substrate with fluorescent reporter at room temperature with a microtiter plate spec...
Bioorg Med Chem 13: 257-64 (2005)
Article DOI: 10.1016/j.bmc.2004.09.036
BindingDB Entry DOI: 10.7270/Q2QV3JVQ