null
SMILES: [O-][N+](=O)c1ccccc1N1CCc2nc(ncc2C1)-c1ccccn1
InChI Key: InChIKey=UYXYNIFXJVAKSQ-UHFFFAOYSA-N
Activity Spreadsheet -- Enzyme Inhibition Constant Data from BindingDB
Found 1 hit for monomerid = 333033
Trg + Lig
Ki
nM
ΔG°
kcal/mole
IC50
nM
Kd
nM
EC50/IC50
nM
koff
s-1
kon
M-1s-1
pHTemp
°C
Genome polyprotein
(Hepatitis GB virus B)
BDBM333033
(US10196391, Example 33)
Show SMILES [O-][N+](=O)c1ccccc1N1CCc2nc(ncc2C1)-c1ccccn1
Show InChI InChI=1S/C18H15N5O2/c24-23(25)17-7-2-1-6-16(17)22-10-8-14-13(12-22)11-20-18(21-14)15-5-3-4-9-19-15/h1-7,9,11H,8,10,12H2
US Patent
n/an/a 390n/an/an/an/an/an/a
Hoffmann-La Roche Inc.
US Patent
Assay Description
HepG2.2.15 cells were seeded in duplicate into white, 96-well plates at 1.5×104 cells/well. The cells were treated with a three-fold serial dilution ...
US Patent US10196391 (2019)
BindingDB Entry DOI: 10.7270/Q2XK8HNM