BDBM333041 US10196391, Example 41
SMILES: Fc1cc(Br)cc(c1)N1CCc2nc(ncc2C1)-c1ncccn1
InChI Key: InChIKey=YEKJNNFJZNACDN-UHFFFAOYSA-N
Data: 1 IC50
Activity Spreadsheet -- Enzyme Inhibition Constant Data from BindingDB
Found 1 hit for monomerid = 333041
Trg + Lig
Ki
nM
ΔG°
kcal/mole
IC50
nM
Kd
nM
EC50/IC50
nM
koff
s-1
kon
M-1s-1
pHTemp
°C
Genome polyprotein
(Hepatitis GB virus B)
BDBM333041
(US10196391, Example 41)
Show SMILES Fc1cc(Br)cc(c1)N1CCc2nc(ncc2C1)-c1ncccn1
Show InChI InChI=1S/C17H13BrFN5/c18-12-6-13(19)8-14(7-12)24-5-2-15-11(10-24)9-22-17(23-15)16-20-3-1-4-21-16/h1,3-4,6-9H,2,5,10H2
US Patent
n/an/a 500n/an/an/an/an/an/a
Hoffmann-La Roche Inc.
US Patent
Assay Description
HepG2.2.15 cells were seeded in duplicate into white, 96-well plates at 1.5×104 cells/well. The cells were treated with a three-fold serial dilution ...
US Patent US10196391 (2019)
BindingDB Entry DOI: 10.7270/Q2XK8HNM