BDBM333055 US10196391, Example 55
SMILES: CCCOc1ccc(cc1F)N1CCc2nc(ncc2C1)-c1ccccn1
InChI Key: InChIKey=XBJHGZYNRQRVPC-UHFFFAOYSA-N
Data: 1 IC50
Activity Spreadsheet -- Enzyme Inhibition Constant Data from BindingDB
Found 1 hit for monomerid = 333055
Trg + Lig
Ki
nM
ΔG°
kcal/mole
IC50
nM
Kd
nM
EC50/IC50
nM
koff
s-1
kon
M-1s-1
pHTemp
°C
Hepatitis GB virus B NS5B RNA-dependent RNA polymerase
(Hepatitis GB virus B)
BDBM333055
(US10196391, Example 55)
Show SMILES CCCOc1ccc(cc1F)N1CCc2nc(ncc2C1)-c1ccccn1
Show InChI InChI=1S/C21H21FN4O/c1-2-11-27-20-7-6-16(12-17(20)22)26-10-8-18-15(14-26)13-24-21(25-18)19-5-3-4-9-23-19/h3-7,9,12-13H,2,8,10-11,14H2,1H3
US Patent
n/an/a 1.18E+3n/an/an/an/an/an/a
Hoffmann-La Roche Inc.
US Patent
Assay Description
HepG2.2.15 cells were seeded in duplicate into white, 96-well plates at 1.5×104 cells/well. The cells were treated with a three-fold serial dilution ...
US Patent US10196391 (2019)
BindingDB Entry DOI: 10.7270/Q2XK8HNM