BDBM333072 US10196391, Example 72
SMILES: COc1nc(ccc1F)N1CCc2nc(ncc2C1)-c1ncccn1
InChI Key: InChIKey=HDIHDEQNCYZKRO-UHFFFAOYSA-N
Data: 1 IC50
Activity Spreadsheet -- Enzyme Inhibition Constant Data from BindingDB
Found 1 hit for monomerid = 333072
Trg + Lig
Ki
nM
ΔG°
kcal/mole
IC50
nM
Kd
nM
EC50/IC50
nM
koff
s-1
kon
M-1s-1
pHTemp
°C
Hepatitis GB virus B NS5B RNA-dependent RNA polymerase
(Hepatitis GB virus B)
BDBM333072
(US10196391, Example 72)
Show SMILES COc1nc(ccc1F)N1CCc2nc(ncc2C1)-c1ncccn1
Show InChI InChI=1S/C17H15FN6O/c1-25-17-12(18)3-4-14(23-17)24-8-5-13-11(10-24)9-21-16(22-13)15-19-6-2-7-20-15/h2-4,6-7,9H,5,8,10H2,1H3
US Patent
n/an/a 1.43E+3n/an/an/an/an/an/a
Hoffmann-La Roche Inc.
US Patent
Assay Description
HepG2.2.15 cells were seeded in duplicate into white, 96-well plates at 1.5×104 cells/well. The cells were treated with a three-fold serial dilution ...
US Patent US10196391 (2019)
BindingDB Entry DOI: 10.7270/Q2XK8HNM