null
SMILES: OCCOc1cc(cc(F)c1F)N1CCc2nc(ncc2C1)-c1ccccn1
InChI Key: InChIKey=CYQPPOIMUDDMSF-UHFFFAOYSA-N
Activity Spreadsheet -- Enzyme Inhibition Constant Data from BindingDB
Found 1 hit for monomerid = 333094
Trg + Lig
Ki
nM
ΔG°
kcal/mole
IC50
nM
Kd
nM
EC50/IC50
nM
koff
s-1
kon
M-1s-1
pHTemp
°C
Genome polyprotein
(Hepatitis GB virus B)
BDBM333094
(US10196391, Example 94)
Show SMILES OCCOc1cc(cc(F)c1F)N1CCc2nc(ncc2C1)-c1ccccn1
Show InChI InChI=1S/C20H18F2N4O2/c21-15-9-14(10-18(19(15)22)28-8-7-27)26-6-4-16-13(12-26)11-24-20(25-16)17-3-1-2-5-23-17/h1-3,5,9-11,27H,4,6-8,12H2
US Patent
n/an/a 660n/an/an/an/an/an/a
Hoffmann-La Roche Inc.
US Patent
Assay Description
HepG2.2.15 cells were seeded in duplicate into white, 96-well plates at 1.5×104 cells/well. The cells were treated with a three-fold serial dilution ...
US Patent US10196391 (2019)
BindingDB Entry DOI: 10.7270/Q2XK8HNM