null
SMILES: COc1cc(Cl)cc(n1)N1CCc2nc(ncc2C1)-c1ncccn1
InChI Key: InChIKey=UIKZFMGNSLRGAH-UHFFFAOYSA-N
Activity Spreadsheet -- Enzyme Inhibition Constant Data from BindingDB
Found 1 hit for monomerid = 333115
Trg + Lig
Ki
nM
ΔG°
kcal/mole
IC50
nM
Kd
nM
EC50/IC50
nM
koff
s-1
kon
M-1s-1
pHTemp
°C
Genome polyprotein
(Hepatitis GB virus B)
BDBM333115
(6-(4-chloro-6-methoxy-2-pyridyl)-2-pyrimidin-2-yl-...)
Show SMILES COc1cc(Cl)cc(n1)N1CCc2nc(ncc2C1)-c1ncccn1
Show InChI InChI=1S/C17H15ClN6O/c1-25-15-8-12(18)7-14(23-15)24-6-3-13-11(10-24)9-21-17(22-13)16-19-4-2-5-20-16/h2,4-5,7-9H,3,6,10H2,1H3
US Patent
n/an/a 352n/an/an/an/an/an/a
Hoffmann-La Roche Inc.
US Patent
Assay Description
HepG2.2.15 cells were seeded in duplicate into white, 96-well plates at 1.5×104 cells/well. The cells were treated with a three-fold serial dilution ...
US Patent US10196391 (2019)
BindingDB Entry DOI: 10.7270/Q2XK8HNM