null
SMILES: COc1cc(F)cc(c1)N1CCc2nc(ncc2C1)-c1ncccn1
InChI Key: InChIKey=XLIZQDZLWGITOY-UHFFFAOYSA-N
Activity Spreadsheet -- Enzyme Inhibition Constant Data from BindingDB
Found 1 hit for monomerid = 333117
Trg + Lig
Ki
nM
ΔG°
kcal/mole
IC50
nM
Kd
nM
EC50/IC50
nM
koff
s-1
kon
M-1s-1
pHTemp
°C
Genome polyprotein
(Hepatitis GB virus B)
BDBM333117
(US10196391, Example 117)
Show SMILES COc1cc(F)cc(c1)N1CCc2nc(ncc2C1)-c1ncccn1
Show InChI InChI=1S/C18H16FN5O/c1-25-15-8-13(19)7-14(9-15)24-6-3-16-12(11-24)10-22-18(23-16)17-20-4-2-5-21-17/h2,4-5,7-10H,3,6,11H2,1H3
US Patent
n/an/a 157n/an/an/an/an/an/a
Hoffmann-La Roche Inc.
US Patent
Assay Description
HepG2.2.15 cells were seeded in duplicate into white, 96-well plates at 1.5×104 cells/well. The cells were treated with a three-fold serial dilution ...
US Patent US10196391 (2019)
BindingDB Entry DOI: 10.7270/Q2XK8HNM