BDBM333402 2-{[3-(Furo[3,2-c]pyridin-2-yl)imidazo[1,2-b]pyridazin-6-yl](methyl)amino}-1-phenylethanol::US9730929, Example 23
SMILES: CN(CC(O)c1ccccc1)c1ccc2ncc(-c3cc4cnccc4o3)n2n1
InChI Key: InChIKey=UOMZPULRWHIKRF-UHFFFAOYSA-N
Data: 1 IC50
Activity Spreadsheet -- Enzyme Inhibition Constant Data from BindingDB
Found 1 hit for monomerid = 333402
Trg + Lig
Ki
nM
ΔG°
kcal/mole
IC50
nM
Kd
nM
EC50/IC50
nM
koff
s-1
kon
M-1s-1
pHTemp
°C
MAP kinase-interacting serine/threonine-protein kinase 1
(Homo sapiens (Human))
BDBM333402
(2-{[3-(Furo[3,2-c]pyridin-2-yl)imidazo[1,2-b]pyrid...)
Show SMILES CN(CC(O)c1ccccc1)c1ccc2ncc(-c3cc4cnccc4o3)n2n1 |w:3.3|
Show InChI InChI=1S/C22H19N5O2/c1-26(14-18(28)15-5-3-2-4-6-15)22-8-7-21-24-13-17(27(21)25-22)20-11-16-12-23-10-9-19(16)29-20/h2-13,18,28H,14H2,1H3
NCI pathway
Reactome pathway
US Patent
n/an/a 1n/an/an/an/an/an/a
BAYER INTELLECTUAL PROPERTY GMBH
US Patent
Assay Description
A recombinant fusion protein of Glutathione-S-Transferase (GST, N-terminally) and human full-length MKNK1 (amino acids 1-424 and T344D of accession n...
US Patent US9730929 (2017)
BindingDB Entry DOI: 10.7270/Q28S4S1H