BDBM33388 dehydroaltenusin derivative, 16
SMILES: CCCCCCCCCCCCOc1cc(O)c2C(=O)OC3(C)CC(=O)C(=O)C=C3c2c1
InChI Key: InChIKey=MCYXVGGWZURKPH-UHFFFAOYSA-N
Data: 2 IC50
Activity Spreadsheet -- Enzyme Inhibition Constant Data from BindingDB
Found 2 hits for monomerid = 33388
Trg + Lig
Ki
nM
ΔG°
kcal/mole
IC50
nM
Kd
nM
EC50/IC50
nM
koff
s-1
kon
M-1s-1
pHTemp
°C
DNA Polymerase beta
(Rattus norvegicus)
BDBM33388
(dehydroaltenusin derivative, 16)
Show SMILES CCCCCCCCCCCCOc1cc(O)c2C(=O)OC3(C)CC(=O)C(=O)C=C3c2c1 |c:28|
Show InChI InChI=1S/C26H34O6/c1-3-4-5-6-7-8-9-10-11-12-13-31-18-14-19-20-16-21(27)23(29)17-26(20,2)32-25(30)24(19)22(28)15-18/h14-16,28H,3-13,17H2,1-2H3
Reactome pathway
n/an/a 1.10E+4n/an/an/an/a7.537
Kyoto Prefectural University
Assay Description
For the DNA polymerase reaction, the dehydroaltenusin derivative was dissolved in dimethyl sulfoxide (DMSO) at various concentrations and sonicated f...
Bioorg Med Chem 17: 7227-38 (2009)
Article DOI: 10.1016/j.bmc.2009.08.051
BindingDB Entry DOI: 10.7270/Q2348HQK
DNA Polymerase alpha
(Bos taurus (bovine))
BDBM33388
(dehydroaltenusin derivative, 16)
Show SMILES CCCCCCCCCCCCOc1cc(O)c2C(=O)OC3(C)CC(=O)C(=O)C=C3c2c1 |c:28|
Show InChI InChI=1S/C26H34O6/c1-3-4-5-6-7-8-9-10-11-12-13-31-18-14-19-20-16-21(27)23(29)17-26(20,2)32-25(30)24(19)22(28)15-18/h14-16,28H,3-13,17H2,1-2H3
n/an/a 60n/an/an/an/a7.537
Kyoto Prefectural University
Assay Description
For the DNA polymerase reaction, the dehydroaltenusin derivative was dissolved in dimethyl sulfoxide (DMSO) at various concentrations and sonicated f...
Bioorg Med Chem 17: 7227-38 (2009)
Article DOI: 10.1016/j.bmc.2009.08.051
BindingDB Entry DOI: 10.7270/Q2348HQK