BDBM334 (3R,4S,5S,6R)-2-benzyl-4,5-dihydroxy-3,6-bis(phenoxymethyl)-7-{[3-(thiophen-2-yl)phenyl]methyl}-1,2,7-thiadiazepane-1,1-dione::(3R,4S,5S,6R)-3,6-Bis(phenoxymethyl)-4,5-O-isopropylidene-7-benzyl-2-[3-(2-thienyl)benzyl]-1,2,7-thiadiazepine 1,1-Dioxide::Cyclic Sulfamide deriv. 12
SMILES: O[C@@H]1[C@@H](O)[C@@H](COc2ccccc2)N(Cc2cccc(c2)-c2cccs2)S(=O)(=O)N(Cc2ccccc2)[C@@H]1COc1ccccc1
InChI Key: InChIKey=BZHUTTKEDGUJII-IHIHPJAWSA-N
Data: 1 KI
Activity Spreadsheet -- Enzyme Inhibition Constant Data from BindingDB
Found 1 hit for monomerid = 334
Trg + Lig
Ki
nM
ΔG°
kcal/mole
IC50
nM
Kd
nM
EC50/IC50
nM
koff
s-1
kon
M-1s-1
pHTemp
°C
HIV-1 Protease
(Human immunodeficiency virus type 1)
BDBM334
((3R,4S,5S,6R)-2-benzyl-4,5-dihydroxy-3,6-bis(pheno...)
Show SMILES O[C@@H]1[C@@H](O)[C@@H](COc2ccccc2)N(Cc2cccc(c2)-c2cccs2)S(=O)(=O)N(Cc2ccccc2)[C@@H]1COc1ccccc1 |r|
Show InChI InChI=1S/C36H36N2O6S2/c39-35-32(25-43-30-16-6-2-7-17-30)37(23-27-12-4-1-5-13-27)46(41,42)38(33(36(35)40)26-44-31-18-8-3-9-19-31)24-28-14-10-15-29(22-28)34-20-11-21-45-34/h1-22,32-33,35-36,39-40H,23-26H2/t32-,33-,35+,36+/m1/s1
86 -9.79n/an/an/an/an/a5.030
Uppsala University
Assay Description
A fluorimetric assay was used to determine the effects of the inhibitors on HIV-1 protease. This assay used an internally quenched fluorescent peptid...
J Med Chem 44: 155-69 (2001)
Article DOI: 10.1021/jm001024j
BindingDB Entry DOI: 10.7270/Q2JM27T6