null
SMILES: OC(=O)c1nc(Cc2ccc(Cl)c(Cl)c2)[nH]c(=O)c1O
InChI Key: InChIKey=OZDSTVKQUHMIRA-UHFFFAOYSA-N
PDB links: 1 PDB ID matches this monomer.
Activity Spreadsheet -- Enzyme Inhibition Constant Data from BindingDB
Found 2 hits for monomerid = 33417
Trg + Lig
Ki
nM
ΔG°
kcal/mole
IC50
nM
Kd
nM
EC50/IC50
nM
koff
s-1
kon
M-1s-1
pHTemp
°C
Ribonuclease H1
(Homo sapiens (Human))
BDBM33417
(pyrimidinol carboxylic acid, 9)
Show SMILES OC(=O)c1nc(Cc2ccc(Cl)c(Cl)c2)[nH]c(=O)c1O
Show InChI InChI=1S/C12H8Cl2N2O4/c13-6-2-1-5(3-7(6)14)4-8-15-9(12(19)20)10(17)11(18)16-8/h1-3,17H,4H2,(H,19,20)(H,15,16,18)
n/an/a>1.00E+5n/an/an/an/a8.020
Gilead Sciences Inc.
Assay Description
Enzyme activity was measuring substrate hydrolysis of RNase H. The intact substrate has a low background fluorescent signal and provides up to 50-fol...
J Med Chem 52: 5781-4 (2009)
Article DOI: 10.1021/jm900597q
BindingDB Entry DOI: 10.7270/Q2TM78F2
Reverse transcriptase/RNaseH
(Human immunodeficiency virus 1)
BDBM33417
(pyrimidinol carboxylic acid, 9)
Show SMILES OC(=O)c1nc(Cc2ccc(Cl)c(Cl)c2)[nH]c(=O)c1O
Show InChI InChI=1S/C12H8Cl2N2O4/c13-6-2-1-5(3-7(6)14)4-8-15-9(12(19)20)10(17)11(18)16-8/h1-3,17H,4H2,(H,19,20)(H,15,16,18)
n/an/a 1.45E+3n/an/an/an/a8.020
Gilead Sciences Inc.
Assay Description
Enzyme activity was measuring substrate hydrolysis of RNase H. The intact substrate has a low background fluorescent signal and provides up to 50-fol...
J Med Chem 52: 5781-4 (2009)
Article DOI: 10.1021/jm900597q
BindingDB Entry DOI: 10.7270/Q2TM78F2
3D
3D Structure (crystal)