BDBM33436 3-(2-furyl)-1-(2-methoxybenzoyl)-1H-1,2,4-triazol-5-amine::MLS000099528::SMR000074220::[5-amino-3-(2-furanyl)-1,2,4-triazol-1-yl]-(2-methoxyphenyl)methanone::[5-amino-3-(2-furyl)-1,2,4-triazol-1-yl]-(2-methoxyphenyl)methanone::[5-amino-3-(furan-2-yl)-1,2,4-triazol-1-yl]-(2-methoxyphenyl)methanone::[5-azanyl-3-(furan-2-yl)-1,2,4-triazol-1-yl]-(2-methoxyphenyl)methanone::cid_969710
SMILES: COc1ccccc1C(=O)n1nc(nc1N)-c1ccco1
InChI Key: InChIKey=BGOHEHPDIIPCBT-UHFFFAOYSA-N
Data: 4 IC50
Activity Spreadsheet -- Enzyme Inhibition Constant Data from BindingDB
Found 4 hits for monomerid = 33436
Trg + Lig
Ki
nM
ΔG°
kcal/mole
IC50
nM
Kd
nM
EC50/IC50
nM
koff
s-1
kon
M-1s-1
pHTemp
°C
Factor XIIa
(Homo sapiens (Human))
BDBM33436
(3-(2-furyl)-1-(2-methoxybenzoyl)-1H-1,2,4-triazol-...)
Show SMILES COc1ccccc1C(=O)n1nc(nc1N)-c1ccco1
Show InChI InChI=1S/C14H12N4O3/c1-20-10-6-3-2-5-9(10)13(19)18-14(15)16-12(17-18)11-7-4-8-21-11/h2-8H,1H3,(H2,15,16,17)
PCBioAssay
n/an/a 2.48E+3n/an/an/an/a7.423
PCMD
Curated by PubChem BioAssay
Assay Description
HTS was performed on a total of 33,068 compounds of the MLSCN library, 23,017 of which were not in the mixture HTS plates used previously. These comp...
PubChem Bioassay (2007)
BindingDB Entry DOI: 10.7270/Q2PV6HQB
Kallikrein 5
(Homo sapiens (Human))
BDBM33436
(3-(2-furyl)-1-(2-methoxybenzoyl)-1H-1,2,4-triazol-...)
Show SMILES COc1ccccc1C(=O)n1nc(nc1N)-c1ccco1
Show InChI InChI=1S/C14H12N4O3/c1-20-10-6-3-2-5-9(10)13(19)18-14(15)16-12(17-18)11-7-4-8-21-11/h2-8H,1H3,(H2,15,16,17)
PCBioAssay
n/an/a 2.25E+3n/an/an/an/an/an/a
PCMD
Curated by PubChem BioAssay
Assay Description
Molecular Library Screening Center Network (MLSCN) Penn Center for Molecular Discovery (PCMD) Assay Provider: Scott L. Diamond, University of Pennsy...
PubChem Bioassay (2008)
BindingDB Entry DOI: 10.7270/Q2GH9GC8
Factor XIIa
(Homo sapiens (Human))
BDBM33436
(3-(2-furyl)-1-(2-methoxybenzoyl)-1H-1,2,4-triazol-...)
Show SMILES COc1ccccc1C(=O)n1nc(nc1N)-c1ccco1
Show InChI InChI=1S/C14H12N4O3/c1-20-10-6-3-2-5-9(10)13(19)18-14(15)16-12(17-18)11-7-4-8-21-11/h2-8H,1H3,(H2,15,16,17)
PCBioAssay
n/an/a 2.48E+3n/an/an/an/an/an/a
PCMD
Curated by PubChem BioAssay
Assay Description
Molecular Library Screening Center Network (MLSCN) Penn Center for Molecular Discovery (PCMD) Assay Provider: Scott L. Diamond, University of Pennsy...
PubChem Bioassay (2008)
BindingDB Entry DOI: 10.7270/Q21G0JQS
Prothrombin
(Homo sapiens (Human))
BDBM33436
(3-(2-furyl)-1-(2-methoxybenzoyl)-1H-1,2,4-triazol-...)
Show SMILES COc1ccccc1C(=O)n1nc(nc1N)-c1ccco1
Show InChI InChI=1S/C14H12N4O3/c1-20-10-6-3-2-5-9(10)13(19)18-14(15)16-12(17-18)11-7-4-8-21-11/h2-8H,1H3,(H2,15,16,17)
PCBioAssay
n/an/a 6.93E+3n/an/an/an/a7.523
PCMD
Curated by PubChem BioAssay
Assay Description
HTS was performed using 217,350 compounds of the MLSCN library individually plated into 10ul 1536 compound plates at a concentration of 2.5 mM each, ...
PubChem Bioassay (2008)
BindingDB Entry DOI: 10.7270/Q2K64GDN