null
SMILES: OC(=O)c1cc(cs1)-c1cnc([nH]1)[C@@H]1CCc2c(Cl)c(cc(=O)n12)-c1cc(Cl)ccc1-n1cnnn1
InChI Key:
Activity Spreadsheet -- Enzyme Inhibition Constant Data from BindingDB
Found 2 hits for monomerid = 335414
Trg + Lig
Ki
nM
ΔG°
kcal/mole
IC50
nM
Kd
nM
EC50/IC50
nM
koff
s-1
kon
M-1s-1
pHTemp
°C
Coagulation factor XI
(Homo sapiens (Human))
BDBM335414
(4-(2-{(3S)-8-chloro-7-[5-chloro-2-(1H-tetrazol-1-y...)
Show SMILES OC(=O)c1cc(cs1)-c1cnc([nH]1)[C@@H]1CCc2c(Cl)c(cc(=O)n12)-c1cc(Cl)ccc1-n1cnnn1 |r|
Reactome pathway
US Patent
n/an/a 1.10n/an/an/an/an/an/a
ONO PHARMACEUTICAL CO., LTD.
US Patent
Assay Description
Human Factor XIa activity was measured at an enzyme concentration of 0.1 U/mL in 150 mM NaCl, 5 mM KCl, 1 mg/mL PEG6000, 50 mM HEPES-NaOH (pH7.4) wit...
US Patent US10717738 (2020)
Coagulation factor XI
(Homo sapiens (Human))
BDBM335414
(4-(2-{(3S)-8-chloro-7-[5-chloro-2-(1H-tetrazol-1-y...)
Show SMILES OC(=O)c1cc(cs1)-c1cnc([nH]1)[C@@H]1CCc2c(Cl)c(cc(=O)n12)-c1cc(Cl)ccc1-n1cnnn1 |r|
Reactome pathway
US Patent
n/an/a 1.10n/an/an/an/an/an/a
ONO PHARMACEUTICAL CO., LTD.
US Patent
Assay Description
Human Factor XIa (Haematologic Technologies Inc.) activity was measured at an enzyme concentration of 0.1 U/mL in 150 mM NaCl, 5 mM KCl, 1 mg/mL PEG6...
US Patent US9732085 (2017)
BindingDB Entry DOI: 10.7270/Q25X2C2P