BDBM335593 3-((5-((4-aminopiperidin-1-yl)methyl)pyrrolo[2,1-f][1,2,4]triazin-4-yl)amino)-5-(2-isopropyl-2H-tetrazol-5-yl)phenol::US9737542, Example 36
SMILES: CC(C)n1nnc(n1)-c1cc(O)cc(Nc2ncnn3ccc(CN4CCC(N)CC4)c23)c1
InChI Key: InChIKey=CNACSDYVLFCDEW-UHFFFAOYSA-N
Data: 2 IC50
Activity Spreadsheet -- Enzyme Inhibition Constant Data from BindingDB
Found 2 hits for monomerid = 335593
Trg + Lig
Ki
nM
ΔG°
kcal/mole
IC50
nM
Kd
nM
EC50/IC50
nM
koff
s-1
kon
M-1s-1
pHTemp
°C
AP2-associated protein kinase 1
(Homo sapiens (Human))
BDBM335593
(3-((5-((4-aminopiperidin-1-yl)methyl)pyrrolo[2,1-f...)
Show SMILES CC(C)n1nnc(n1)-c1cc(O)cc(Nc2ncnn3ccc(CN4CCC(N)CC4)c23)c1
Show InChI InChI=1S/C22H28N10O/c1-14(2)32-28-21(27-29-32)16-9-18(11-19(33)10-16)26-22-20-15(3-8-31(20)25-13-24-22)12-30-6-4-17(23)5-7-30/h3,8-11,13-14,17,33H,4-7,12,23H2,1-2H3,(H,24,25,26)
n/an/a 3.30n/an/an/an/an/an/a
KU Leuven
Curated by ChEMBL
Assay Description
Inhibition of thrombin-recognition site-fused GST-tagged human AAK1 expressed in bacterial expression system using 5-FAM-Aha-KEEQSQITSQVTGQIGWR-NH2 a...
J Med Chem 62: 5810-5831 (2019)
Article DOI: 10.1021/acs.jmedchem.9b00136
AP2-associated protein kinase 1
(Homo sapiens (Human))
BDBM335593
(3-((5-((4-aminopiperidin-1-yl)methyl)pyrrolo[2,1-f...)
Show SMILES CC(C)n1nnc(n1)-c1cc(O)cc(Nc2ncnn3ccc(CN4CCC(N)CC4)c23)c1
Show InChI InChI=1S/C22H28N10O/c1-14(2)32-28-21(27-29-32)16-9-18(11-19(33)10-16)26-22-20-15(3-8-31(20)25-13-24-22)12-30-6-4-17(23)5-7-30/h3,8-11,13-14,17,33H,4-7,12,23H2,1-2H3,(H,24,25,26)
US Patent
n/an/a 3.30n/an/an/an/an/an/a
Bristol-Myers Squibb Company
US Patent
Assay Description
The assays were performed in U-bottom 384-well plates. The final assay volume was 30 μl prepared from 15 μl additions of enzyme and substra...
US Patent US9737542 (2017)
BindingDB Entry DOI: 10.7270/Q2N018NQ