null
SMILES: CNC(=O)c1c([Se][Se]c2[nH]c3ccccc3c2C(=O)NC)[nH]c2ccccc12
InChI Key: InChIKey=SSIOMHJBYZEOEK-UHFFFAOYSA-N
Activity Spreadsheet -- Enzyme Inhibition Constant Data from BindingDB
Found 3 hits for monomerid = 3356
Trg + Lig
Ki
nM
ΔG°
kcal/mole
IC50
nM
Kd
nM
EC50/IC50
nM
koff
s-1
kon
M-1s-1
pHTemp
°C
Epidermal growth factor receptor
(Homo sapiens (Human))
BDBM3356
(2,2 -Diselenobis[N-methyl-1H-indole-3-carboxamide]...)
Show SMILES CNC(=O)c1c([Se][Se]c2[nH]c3ccccc3c2C(=O)NC)[nH]c2ccccc12
Show InChI InChI=1S/C20H18N4O2Se2/c1-21-17(25)15-11-7-3-5-9-13(11)23-19(15)27-28-20-16(18(26)22-2)12-8-4-6-10-14(12)24-20/h3-10,23-24H,1-2H3,(H,21,25)(H,22,26)
n/an/a 1.30E+4n/an/an/an/a7.422
Parke-Davis Pharmaceutical Research
Assay Description
IC50 is the inhibitor concentration which inhibits 50% of kinase activity that catalyzes the transfer of the terminal phosphate from [gamma-32P] labe...
J Med Chem 40: 413-26 (1997)
Article DOI: 10.1021/jm960689b
BindingDB Entry DOI: 10.7270/Q2TH8JWJ
Tyrosine-protein kinase transforming protein Src
(Avian sarcoma virus)
BDBM3356
(2,2 -Diselenobis[N-methyl-1H-indole-3-carboxamide]...)
Show SMILES CNC(=O)c1c([Se][Se]c2[nH]c3ccccc3c2C(=O)NC)[nH]c2ccccc12
Show InChI InChI=1S/C20H18N4O2Se2/c1-21-17(25)15-11-7-3-5-9-13(11)23-19(15)27-28-20-16(18(26)22-2)12-8-4-6-10-14(12)24-20/h3-10,23-24H,1-2H3,(H,21,25)(H,22,26)
n/an/a 2.80E+3n/an/an/an/an/an/a
Parke-Davis Pharmaceutical Research
Assay Description
IC50 is the inhibitor concentration which inhibits 50% of kinase activity that catalyzes the transfer of the terminal phosphate from [gamma-32P] labe...
J Med Chem 40: 413-26 (1997)
Article DOI: 10.1021/jm960689b
BindingDB Entry DOI: 10.7270/Q2TH8JWJ
Platelet-derived growth factor receptor beta
(Mus musculus (mouse))
BDBM3356
(2,2 -Diselenobis[N-methyl-1H-indole-3-carboxamide]...)
Show SMILES CNC(=O)c1c([Se][Se]c2[nH]c3ccccc3c2C(=O)NC)[nH]c2ccccc12
Show InChI InChI=1S/C20H18N4O2Se2/c1-21-17(25)15-11-7-3-5-9-13(11)23-19(15)27-28-20-16(18(26)22-2)12-8-4-6-10-14(12)24-20/h3-10,23-24H,1-2H3,(H,21,25)(H,22,26)
n/an/a 8.00E+3n/an/an/an/a7.425
Parke-Davis Pharmaceutical Research
Assay Description
IC50 is the inhibitor concentration which inhibits 50% of kinase activity that catalyzes the transfer of the terminal phosphate from [gamma-32P] labe...
J Med Chem 40: 413-26 (1997)
Article DOI: 10.1021/jm960689b
BindingDB Entry DOI: 10.7270/Q2TH8JWJ