BDBM335716 N-((6,8-Difluoro-1-methyl-3-oxo- 2,3-dihydroisoquinolin-4- yl)methyl)-5-(ethyl(tetrahydro- 2H-pyran-4-yl)amino)-4-methyl- 4'-(morpholinomethyl)-[1,1'- biphenyl]-3-carboxamide::US9738630, Example 11
SMILES: CCN(C1CCOCC1)c1cc(cc(C(=O)NCc2c3cc(F)cc(F)c3c(C)[nH]c2=O)c1C)-c1ccc(CN2CCOCC2)cc1
InChI Key: InChIKey=SDMGNZSKNHIHSX-UHFFFAOYSA-N
Data: 1 EC50
Activity Spreadsheet -- Enzyme Inhibition Constant Data from BindingDB
Found 1 hit for monomerid = 335716
Trg + Lig
Ki
nM
ΔG°
kcal/mole
IC50
nM
Kd
nM
EC50/IC50
nM
koff
s-1
kon
M-1s-1
pHTemp
°C
Histone-lysine N-methyltransferase EZH2
(Homo sapiens (Human))
BDBM335716
(N-((6,8-Difluoro-1-methyl-3-oxo- 2,3-dihydroisoqui...)
Show SMILES CCN(C1CCOCC1)c1cc(cc(C(=O)NCc2c3cc(F)cc(F)c3c(C)[nH]c2=O)c1C)-c1ccc(CN2CCOCC2)cc1
Show InChI InChI=1S/C37H42F2N4O4/c1-4-43(29-9-13-46-14-10-29)34-18-27(26-7-5-25(6-8-26)22-42-11-15-47-16-12-42)17-30(23(34)2)36(44)40-21-32-31-19-28(38)20-33(39)35(31)24(3)41-37(32)45/h5-8,17-20,29H,4,9-16,21-22H2,1-3H3,(H,40,44)(H,41,45)
US Patent
n/an/an/an/a<5.00E+3n/an/an/an/a
Bristol-Myers Squibb Company
US Patent
Assay Description
The effectiveness of compounds of the present invention as inhibitors of hitone methyl transferases can be readily tested by assays known to those sk...
US Patent US9738630 (2017)
BindingDB Entry DOI: 10.7270/Q23X88R2