BDBM335723 2,2-Dimethyl-N-((1-methyl-3- oxo-2,3-dihydroisoquinolin-4- yl)methyl)-7-(6-(piperazin-1- yl)pyridin-3-yl)-2,3- dihydrobenzofuran-5- carboxamide::US9738630, Example 17
SMILES: Cc1[nH]c(=O)c(CNC(=O)c2cc3CC(C)(C)Oc3c(c2)-c2ccc(nc2)N2CCNCC2)c2ccccc12
InChI Key: InChIKey=ZUSPPJRHONBPFB-UHFFFAOYSA-N
Data: 1 EC50
Activity Spreadsheet -- Enzyme Inhibition Constant Data from BindingDB
Found 1 hit for monomerid = 335723
Trg + Lig
Ki
nM
ΔG°
kcal/mole
IC50
nM
Kd
nM
EC50/IC50
nM
koff
s-1
kon
M-1s-1
pHTemp
°C
Histone-lysine N-methyltransferase EZH2
(Homo sapiens (Human))
BDBM335723
(2,2-Dimethyl-N-((1-methyl-3- oxo-2,3-dihydroisoqui...)
Show SMILES Cc1[nH]c(=O)c(CNC(=O)c2cc3CC(C)(C)Oc3c(c2)-c2ccc(nc2)N2CCNCC2)c2ccccc12
Show InChI InChI=1S/C31H33N5O3/c1-19-23-6-4-5-7-24(23)26(30(38)35-19)18-34-29(37)21-14-22-16-31(2,3)39-28(22)25(15-21)20-8-9-27(33-17-20)36-12-10-32-11-13-36/h4-9,14-15,17,32H,10-13,16,18H2,1-3H3,(H,34,37)(H,35,38)
US Patent
n/an/an/an/a<5.00E+3n/an/an/an/a
Bristol-Myers Squibb Company
US Patent
Assay Description
The effectiveness of compounds of the present invention as inhibitors of hitone methyl transferases can be readily tested by assays known to those sk...
US Patent US9738630 (2017)
BindingDB Entry DOI: 10.7270/Q23X88R2