BDBM336152 US9744148, 21
SMILES: COc1ccc(CC(=O)OC(C)C(=O)Nc2ccccc2)cc1
InChI Key: InChIKey=YUAXEHZHDZFUIO-UHFFFAOYSA-N
Data: 1 IC50
Activity Spreadsheet -- Enzyme Inhibition Constant Data from BindingDB
Found 1 hit for monomerid = 336152
Trg + Lig
Ki
nM
ΔG°
kcal/mole
IC50
nM
Kd
nM
EC50/IC50
nM
koff
s-1
kon
M-1s-1
pHTemp
°C
Kallikrein-7
(Homo sapiens (Human))
BDBM336152
(US9744148, 21)
Show SMILES COc1ccc(CC(=O)OC(C)C(=O)Nc2ccccc2)cc1
Show InChI InChI=1S/C18H19NO4/c1-13(18(21)19-15-6-4-3-5-7-15)23-17(20)12-14-8-10-16(22-2)11-9-14/h3-11,13H,12H2,1-2H3,(H,19,21)
Reactome pathway
US Patent
n/an/a 260n/an/an/an/an/an/a
SIXERA Pharma AB
US Patent
Assay Description
Substrate:(MeO-Suc-Arg-Pro-Tyr-pNA), acetate salt, Peptide international, lot #906841, previously named S-2586Enzyme: Active human KLK7 (SCCE) 0.62 m...
US Patent US9744148 (2017)
BindingDB Entry DOI: 10.7270/Q2TH8PSV