null
SMILES: NS(=O)(=O)c1ccccc1OCC(=O)NCC(O)CN1CCc2ccccc2C1
InChI Key: InChIKey=BLPQJYLBMADCRK-UHFFFAOYSA-N
Activity Spreadsheet -- Enzyme Inhibition Constant Data from BindingDB
Found 2 hits for monomerid = 337019
Trg + Lig
Ki
nM
ΔG°
kcal/mole
IC50
nM
Kd
nM
EC50/IC50
nM
koff
s-1
kon
M-1s-1
pHTemp
°C
Protein arginine N-methyltransferase 5
(Homo sapiens (Human))
BDBM337019
(US9745291, Compound 65 | US9765068, Compound 65)
Show SMILES NS(=O)(=O)c1ccccc1OCC(=O)NCC(O)CN1CCc2ccccc2C1
Show InChI InChI=1S/C20H25N3O5S/c21-29(26,27)19-8-4-3-7-18(19)28-14-20(25)22-11-17(24)13-23-10-9-15-5-1-2-6-16(15)12-23/h1-8,17,24H,9-14H2,(H,22,25)(H2,21,26,27)
US Patent
n/an/a<100n/an/an/an/an/an/a
Epizyme, Inc.
US Patent
Assay Description
Molecular Biology: Full-length human PRMT5 (NM_006109.3) transcript variant 1 clone was amplified from a fetal brain cDNA library, incorporating flan...
US Patent US9765068 (2017)
BindingDB Entry DOI: 10.7270/Q2959KN3
Methylosome protein 50/Protein arginine N-methyltransferase 5
(Homo sapiens (Human))
BDBM337019
(US9745291, Compound 65 | US9765068, Compound 65)
Show SMILES NS(=O)(=O)c1ccccc1OCC(=O)NCC(O)CN1CCc2ccccc2C1
Show InChI InChI=1S/C20H25N3O5S/c21-29(26,27)19-8-4-3-7-18(19)28-14-20(25)22-11-17(24)13-23-10-9-15-5-1-2-6-16(15)12-23/h1-8,17,24H,9-14H2,(H,22,25)(H2,21,26,27)
US Patent
n/an/a<100n/an/an/an/an/an/a
Epizyme, Inc.
US Patent
Assay Description
The assays were all performed in a buffer consisting of 20 mM Bicine (pH=7.6), 1 mM TCEP, 0.005% BSG, and 0.002% Tween20, prepared on the day of use....
US Patent US9745291 (2017)
BindingDB Entry DOI: 10.7270/Q2J1058K