null
SMILES: CN(C)CCOc1ccccc1OCC(=O)NC[C@H](O)CN1CCc2ccccc2C1
InChI Key: InChIKey=HBQRDBQJOLFTNW-NRFANRHFSA-N
Activity Spreadsheet -- Enzyme Inhibition Constant Data from BindingDB
Found 2 hits for monomerid = 337042
Trg + Lig
Ki
nM
ΔG°
kcal/mole
IC50
nM
Kd
nM
EC50/IC50
nM
koff
s-1
kon
M-1s-1
pHTemp
°C
Protein arginine N-methyltransferase 5
(Homo sapiens (Human))
BDBM337042
(US9745291, Compound 88 | US9765068, Compound 88)
Show SMILES CN(C)CCOc1ccccc1OCC(=O)NC[C@H](O)CN1CCc2ccccc2C1 |r|
Show InChI InChI=1S/C24H33N3O4/c1-26(2)13-14-30-22-9-5-6-10-23(22)31-18-24(29)25-15-21(28)17-27-12-11-19-7-3-4-8-20(19)16-27/h3-10,21,28H,11-18H2,1-2H3,(H,25,29)/t21-/m0/s1
US Patent
n/an/a<100n/an/an/an/an/an/a
Epizyme, Inc.
US Patent
Assay Description
Molecular Biology: Full-length human PRMT5 (NM_006109.3) transcript variant 1 clone was amplified from a fetal brain cDNA library, incorporating flan...
US Patent US9765068 (2017)
BindingDB Entry DOI: 10.7270/Q2959KN3
Methylosome protein 50/Protein arginine N-methyltransferase 5
(Homo sapiens (Human))
BDBM337042
(US9745291, Compound 88 | US9765068, Compound 88)
Show SMILES CN(C)CCOc1ccccc1OCC(=O)NC[C@H](O)CN1CCc2ccccc2C1 |r|
Show InChI InChI=1S/C24H33N3O4/c1-26(2)13-14-30-22-9-5-6-10-23(22)31-18-24(29)25-15-21(28)17-27-12-11-19-7-3-4-8-20(19)16-27/h3-10,21,28H,11-18H2,1-2H3,(H,25,29)/t21-/m0/s1
US Patent
n/an/a<100n/an/an/an/an/an/a
Epizyme, Inc.
US Patent
Assay Description
The assays were all performed in a buffer consisting of 20 mM Bicine (pH=7.6), 1 mM TCEP, 0.005% BSG, and 0.002% Tween20, prepared on the day of use....
US Patent US9745291 (2017)
BindingDB Entry DOI: 10.7270/Q2J1058K