null
SMILES: OC(CNC(=O)COc1cccc2OCCOc12)CN1CCc2ccccc2C1
InChI Key: InChIKey=UBBHDVBKROZNFI-UHFFFAOYSA-N
Activity Spreadsheet -- Enzyme Inhibition Constant Data from BindingDB
Found 2 hits for monomerid = 337054
Trg + Lig
Ki
nM
ΔG°
kcal/mole
IC50
nM
Kd
nM
EC50/IC50
nM
koff
s-1
kon
M-1s-1
pHTemp
°C
Protein arginine N-methyltransferase 5
(Homo sapiens (Human))
BDBM337054
(US9745291, Compound 100 | US9765068, Compound 100)
Show SMILES OC(CNC(=O)COc1cccc2OCCOc12)CN1CCc2ccccc2C1
Show InChI InChI=1S/C22H26N2O5/c25-18(14-24-9-8-16-4-1-2-5-17(16)13-24)12-23-21(26)15-29-20-7-3-6-19-22(20)28-11-10-27-19/h1-7,18,25H,8-15H2,(H,23,26)
US Patent
n/an/a<100n/an/an/an/an/an/a
Epizyme, Inc.
US Patent
Assay Description
Molecular Biology: Full-length human PRMT5 (NM_006109.3) transcript variant 1 clone was amplified from a fetal brain cDNA library, incorporating flan...
US Patent US9765068 (2017)
BindingDB Entry DOI: 10.7270/Q2959KN3
Methylosome protein 50/Protein arginine N-methyltransferase 5
(Homo sapiens (Human))
BDBM337054
(US9745291, Compound 100 | US9765068, Compound 100)
Show SMILES OC(CNC(=O)COc1cccc2OCCOc12)CN1CCc2ccccc2C1
Show InChI InChI=1S/C22H26N2O5/c25-18(14-24-9-8-16-4-1-2-5-17(16)13-24)12-23-21(26)15-29-20-7-3-6-19-22(20)28-11-10-27-19/h1-7,18,25H,8-15H2,(H,23,26)
US Patent
n/an/a<100n/an/an/an/an/an/a
Epizyme, Inc.
US Patent
Assay Description
The assays were all performed in a buffer consisting of 20 mM Bicine (pH=7.6), 1 mM TCEP, 0.005% BSG, and 0.002% Tween20, prepared on the day of use....
US Patent US9745291 (2017)
BindingDB Entry DOI: 10.7270/Q2J1058K