null
SMILES: CN(C)c1ccc2cccc(OCC(=O)NC[C@@H](O)CN3CCc4ccccc4C3)c2n1
InChI Key: InChIKey=NQYRQXHXODTULO-OAQYLSRUSA-N
Activity Spreadsheet -- Enzyme Inhibition Constant Data from BindingDB
Found 2 hits for monomerid = 337059
Trg + Lig
Ki
nM
ΔG°
kcal/mole
IC50
nM
Kd
nM
EC50/IC50
nM
koff
s-1
kon
M-1s-1
pHTemp
°C
Protein arginine N-methyltransferase 5
(Homo sapiens (Human))
BDBM337059
(US9745291, Compound 105 | US9765068, Compound 105)
Show SMILES CN(C)c1ccc2cccc(OCC(=O)NC[C@@H](O)CN3CCc4ccccc4C3)c2n1 |r|
Show InChI InChI=1S/C25H30N4O3/c1-28(2)23-11-10-19-8-5-9-22(25(19)27-23)32-17-24(31)26-14-21(30)16-29-13-12-18-6-3-4-7-20(18)15-29/h3-11,21,30H,12-17H2,1-2H3,(H,26,31)/t21-/m1/s1
US Patent
n/an/a<100n/an/an/an/an/an/a
Epizyme, Inc.
US Patent
Assay Description
Molecular Biology: Full-length human PRMT5 (NM_006109.3) transcript variant 1 clone was amplified from a fetal brain cDNA library, incorporating flan...
US Patent US9765068 (2017)
BindingDB Entry DOI: 10.7270/Q2959KN3
Methylosome protein 50/Protein arginine N-methyltransferase 5
(Homo sapiens (Human))
BDBM337059
(US9745291, Compound 105 | US9765068, Compound 105)
Show SMILES CN(C)c1ccc2cccc(OCC(=O)NC[C@@H](O)CN3CCc4ccccc4C3)c2n1 |r|
Show InChI InChI=1S/C25H30N4O3/c1-28(2)23-11-10-19-8-5-9-22(25(19)27-23)32-17-24(31)26-14-21(30)16-29-13-12-18-6-3-4-7-20(18)15-29/h3-11,21,30H,12-17H2,1-2H3,(H,26,31)/t21-/m1/s1
US Patent
n/an/a<100n/an/an/an/an/an/a
Epizyme, Inc.
US Patent
Assay Description
The assays were all performed in a buffer consisting of 20 mM Bicine (pH=7.6), 1 mM TCEP, 0.005% BSG, and 0.002% Tween20, prepared on the day of use....
US Patent US9745291 (2017)
BindingDB Entry DOI: 10.7270/Q2J1058K