null
SMILES: Cc1cn(C)c2cccc(OCC(=O)NCC(O)CN3CCc4ccccc4C3)c12
InChI Key: InChIKey=FQQVYCLWFXTPCF-UHFFFAOYSA-N
Activity Spreadsheet -- Enzyme Inhibition Constant Data from BindingDB
Found 2 hits for monomerid = 337100
Trg + Lig
Ki
nM
ΔG°
kcal/mole
IC50
nM
Kd
nM
EC50/IC50
nM
koff
s-1
kon
M-1s-1
pHTemp
°C
Protein arginine N-methyltransferase 5
(Homo sapiens (Human))
BDBM337100
(US9745291, Compound 146 | US9765068, Compound 146)
Show SMILES Cc1cn(C)c2cccc(OCC(=O)NCC(O)CN3CCc4ccccc4C3)c12
Show InChI InChI=1S/C24H29N3O3/c1-17-13-26(2)21-8-5-9-22(24(17)21)30-16-23(29)25-12-20(28)15-27-11-10-18-6-3-4-7-19(18)14-27/h3-9,13,20,28H,10-12,14-16H2,1-2H3,(H,25,29)
US Patent
n/an/a<100n/an/an/an/an/an/a
Epizyme, Inc.
US Patent
Assay Description
Molecular Biology: Full-length human PRMT5 (NM_006109.3) transcript variant 1 clone was amplified from a fetal brain cDNA library, incorporating flan...
US Patent US9765068 (2017)
BindingDB Entry DOI: 10.7270/Q2959KN3
Methylosome protein 50/Protein arginine N-methyltransferase 5
(Homo sapiens (Human))
BDBM337100
(US9745291, Compound 146 | US9765068, Compound 146)
Show SMILES Cc1cn(C)c2cccc(OCC(=O)NCC(O)CN3CCc4ccccc4C3)c12
Show InChI InChI=1S/C24H29N3O3/c1-17-13-26(2)21-8-5-9-22(24(17)21)30-16-23(29)25-12-20(28)15-27-11-10-18-6-3-4-7-19(18)14-27/h3-9,13,20,28H,10-12,14-16H2,1-2H3,(H,25,29)
US Patent
n/an/a<100n/an/an/an/an/an/a
Epizyme, Inc.
US Patent
Assay Description
The assays were all performed in a buffer consisting of 20 mM Bicine (pH=7.6), 1 mM TCEP, 0.005% BSG, and 0.002% Tween20, prepared on the day of use....
US Patent US9745291 (2017)
BindingDB Entry DOI: 10.7270/Q2J1058K