null
SMILES: CN(CCN)S(=O)(=O)c1ccccc1OCC(=O)NC[C@@H](O)CN1CCc2ccccc2C1
InChI Key: InChIKey=DPBMSRKLMQRLKW-HXUWFJFHSA-N
Activity Spreadsheet -- Enzyme Inhibition Constant Data from BindingDB
Found 1 hit for monomerid = 337152
Trg + Lig
Ki
nM
ΔG°
kcal/mole
IC50
nM
Kd
nM
EC50/IC50
nM
koff
s-1
kon
M-1s-1
pHTemp
°C
Methylosome protein 50/Protein arginine N-methyltransferase 5
(Homo sapiens (Human))
BDBM337152
(US9745291, Compound 198)
Show SMILES CN(CCN)S(=O)(=O)c1ccccc1OCC(=O)NC[C@@H](O)CN1CCc2ccccc2C1 |r|
Show InChI InChI=1S/C23H32N4O5S/c1-26(13-11-24)33(30,31)22-9-5-4-8-21(22)32-17-23(29)25-14-20(28)16-27-12-10-18-6-2-3-7-19(18)15-27/h2-9,20,28H,10-17,24H2,1H3,(H,25,29)/t20-/m1/s1
US Patent
n/an/a<100n/an/an/an/an/an/a
Epizyme, Inc.
US Patent
Assay Description
The assays were all performed in a buffer consisting of 20 mM Bicine (pH=7.6), 1 mM TCEP, 0.005% BSG, and 0.002% Tween20, prepared on the day of use....
US Patent US9745291 (2017)
BindingDB Entry DOI: 10.7270/Q2J1058K