BDBM337895 US9751854, Compound I-76::US9802960, Compound I-76
SMILES: CN(Cc1ccccc1)S(=O)(=O)c1cc(cnc1N)-c1ccnc(NC(C)=O)c1
InChI Key: InChIKey=FCIUDSHYJSXPJU-UHFFFAOYSA-N
Data: 2 IC50
Activity Spreadsheet -- Enzyme Inhibition Constant Data from BindingDB
Found 2 hits for monomerid = 337895
Trg + Lig
Ki
nM
ΔG°
kcal/mole
IC50
nM
Kd
nM
EC50/IC50
nM
koff
s-1
kon
M-1s-1
pHTemp
°C
Phosphatidylinositol 3-kinase catalytic subunit type 3
(Homo sapiens (Human))
BDBM337895
(US9751854, Compound I-76 | US9802960, Compound I-7...)
Show SMILES CN(Cc1ccccc1)S(=O)(=O)c1cc(cnc1N)-c1ccnc(NC(C)=O)c1
Show InChI InChI=1S/C20H21N5O3S/c1-14(26)24-19-11-16(8-9-22-19)17-10-18(20(21)23-12-17)29(27,28)25(2)13-15-6-4-3-5-7-15/h3-12H,13H2,1-2H3,(H2,21,23)(H,22,24,26)
Reactome pathway
US Patent
n/an/a<10n/an/an/an/an/an/a
Millennium Pharmaceuticals, Inc.
US Patent
Assay Description
100 nL compounds in DMSO are added to wells of a 384 well microtitre plate (Greiner 780076). At room temperature: 5 ul VPS34 reaction buffer (Invitro...
US Patent US9802960 (2017)
BindingDB Entry DOI: 10.7270/Q2D79DJ9
Phosphatidylinositol 3-kinase catalytic subunit type 3
(Homo sapiens (Human))
BDBM337895
(US9751854, Compound I-76 | US9802960, Compound I-7...)
Show SMILES CN(Cc1ccccc1)S(=O)(=O)c1cc(cnc1N)-c1ccnc(NC(C)=O)c1
Show InChI InChI=1S/C20H21N5O3S/c1-14(26)24-19-11-16(8-9-22-19)17-10-18(20(21)23-12-17)29(27,28)25(2)13-15-6-4-3-5-7-15/h3-12H,13H2,1-2H3,(H2,21,23)(H,22,24,26)
Reactome pathway
US Patent
n/an/a<10n/an/an/an/an/an/a
Millennium Pharmaceuticals, Inc.
US Patent
Assay Description
100 nL compounds in DMSO are added to wells of a 384 well microtitre plate (Greiner 780076). At room temperature: 5 ul VPS34 reaction buffer (Invitro...
US Patent US9751854 (2017)
BindingDB Entry DOI: 10.7270/Q2KS6TNJ