BDBM337920 US9751854, Compound I-101::US9802960, Compound I-101
SMILES: CC(=O)Nc1cc(ccn1)-c1cnc(N)c(c1)S(=O)(=O)NC1CCCCC1
InChI Key: InChIKey=ZTIIWGXEMIJGKW-UHFFFAOYSA-N
Data: 2 IC50
Activity Spreadsheet -- Enzyme Inhibition Constant Data from BindingDB
Found 2 hits for monomerid = 337920
Trg + Lig
Ki
nM
ΔG°
kcal/mole
IC50
nM
Kd
nM
EC50/IC50
nM
koff
s-1
kon
M-1s-1
pHTemp
°C
Phosphatidylinositol 3-kinase catalytic subunit type 3
(Homo sapiens (Human))
BDBM337920
(US9751854, Compound I-101 | US9802960, Compound I-...)
Show SMILES CC(=O)Nc1cc(ccn1)-c1cnc(N)c(c1)S(=O)(=O)NC1CCCCC1
Show InChI InChI=1S/C18H23N5O3S/c1-12(24)22-17-10-13(7-8-20-17)14-9-16(18(19)21-11-14)27(25,26)23-15-5-3-2-4-6-15/h7-11,15,23H,2-6H2,1H3,(H2,19,21)(H,20,22,24)
Reactome pathway
US Patent
n/an/a<10n/an/an/an/an/an/a
Millennium Pharmaceuticals, Inc.
US Patent
Assay Description
100 nL compounds in DMSO are added to wells of a 384 well microtitre plate (Greiner 780076). At room temperature: 5 ul VPS34 reaction buffer (Invitro...
US Patent US9802960 (2017)
BindingDB Entry DOI: 10.7270/Q2D79DJ9
Phosphatidylinositol 3-kinase catalytic subunit type 3
(Homo sapiens (Human))
BDBM337920
(US9751854, Compound I-101 | US9802960, Compound I-...)
Show SMILES CC(=O)Nc1cc(ccn1)-c1cnc(N)c(c1)S(=O)(=O)NC1CCCCC1
Show InChI InChI=1S/C18H23N5O3S/c1-12(24)22-17-10-13(7-8-20-17)14-9-16(18(19)21-11-14)27(25,26)23-15-5-3-2-4-6-15/h7-11,15,23H,2-6H2,1H3,(H2,19,21)(H,20,22,24)
Reactome pathway
US Patent
n/an/a<10n/an/an/an/an/an/a
Millennium Pharmaceuticals, Inc.
US Patent
Assay Description
100 nL compounds in DMSO are added to wells of a 384 well microtitre plate (Greiner 780076). At room temperature: 5 ul VPS34 reaction buffer (Invitro...
US Patent US9751854 (2017)
BindingDB Entry DOI: 10.7270/Q2KS6TNJ