BDBM337966 US9751854, Compound I-142::US9802960, Compound I-142
SMILES: COc1cc(C)ccc1S(=O)(=O)Nc1cc(cnc1C)-c1ccnc(NC(C)=O)c1
InChI Key: InChIKey=ILPGODWNGNYVKZ-UHFFFAOYSA-N
Data: 2 IC50
Activity Spreadsheet -- Enzyme Inhibition Constant Data from BindingDB
Found 2 hits for monomerid = 337966
Trg + Lig
Ki
nM
ΔG°
kcal/mole
IC50
nM
Kd
nM
EC50/IC50
nM
koff
s-1
kon
M-1s-1
pHTemp
°C
Phosphatidylinositol 3-kinase catalytic subunit type 3
(Homo sapiens (Human))
BDBM337966
(US9751854, Compound I-142 | US9802960, Compound I-...)
Show SMILES COc1cc(C)ccc1S(=O)(=O)Nc1cc(cnc1C)-c1ccnc(NC(C)=O)c1
Show InChI InChI=1S/C21H22N4O4S/c1-13-5-6-20(19(9-13)29-4)30(27,28)25-18-10-17(12-23-14(18)2)16-7-8-22-21(11-16)24-15(3)26/h5-12,25H,1-4H3,(H,22,24,26)
Reactome pathway
US Patent
n/an/a<10n/an/an/an/an/an/a
Millennium Pharmaceuticals, Inc.
US Patent
Assay Description
100 nL compounds in DMSO are added to wells of a 384 well microtitre plate (Greiner 780076). At room temperature: 5 ul VPS34 reaction buffer (Invitro...
US Patent US9802960 (2017)
BindingDB Entry DOI: 10.7270/Q2D79DJ9
Phosphatidylinositol 3-kinase catalytic subunit type 3
(Homo sapiens (Human))
BDBM337966
(US9751854, Compound I-142 | US9802960, Compound I-...)
Show SMILES COc1cc(C)ccc1S(=O)(=O)Nc1cc(cnc1C)-c1ccnc(NC(C)=O)c1
Show InChI InChI=1S/C21H22N4O4S/c1-13-5-6-20(19(9-13)29-4)30(27,28)25-18-10-17(12-23-14(18)2)16-7-8-22-21(11-16)24-15(3)26/h5-12,25H,1-4H3,(H,22,24,26)
Reactome pathway
US Patent
n/an/a<10n/an/an/an/an/an/a
Millennium Pharmaceuticals, Inc.
US Patent
Assay Description
100 nL compounds in DMSO are added to wells of a 384 well microtitre plate (Greiner 780076). At room temperature: 5 ul VPS34 reaction buffer (Invitro...
US Patent US9751854 (2017)
BindingDB Entry DOI: 10.7270/Q2KS6TNJ