BDBM337980 US9751854, Compound I-156::US9802960, Compound I-156
SMILES: CC(=O)Nc1cc(ccn1)-c1cnc(N)c(c1)S(=O)(=O)N1CCCCC1
InChI Key: InChIKey=LIZLTFKAOMXGEN-UHFFFAOYSA-N
Data: 2 IC50
Activity Spreadsheet -- Enzyme Inhibition Constant Data from BindingDB
Found 2 hits for monomerid = 337980
Trg + Lig
Ki
nM
ΔG°
kcal/mole
IC50
nM
Kd
nM
EC50/IC50
nM
koff
s-1
kon
M-1s-1
pHTemp
°C
Phosphatidylinositol 3-kinase catalytic subunit type 3
(Homo sapiens (Human))
BDBM337980
(US9751854, Compound I-156 | US9802960, Compound I-...)
Show SMILES CC(=O)Nc1cc(ccn1)-c1cnc(N)c(c1)S(=O)(=O)N1CCCCC1
Show InChI InChI=1S/C17H21N5O3S/c1-12(23)21-16-10-13(5-6-19-16)14-9-15(17(18)20-11-14)26(24,25)22-7-3-2-4-8-22/h5-6,9-11H,2-4,7-8H2,1H3,(H2,18,20)(H,19,21,23)
Reactome pathway
US Patent
n/an/a<10n/an/an/an/an/an/a
Millennium Pharmaceuticals, Inc.
US Patent
Assay Description
100 nL compounds in DMSO are added to wells of a 384 well microtitre plate (Greiner 780076). At room temperature: 5 ul VPS34 reaction buffer (Invitro...
US Patent US9802960 (2017)
BindingDB Entry DOI: 10.7270/Q2D79DJ9
Phosphatidylinositol 3-kinase catalytic subunit type 3
(Homo sapiens (Human))
BDBM337980
(US9751854, Compound I-156 | US9802960, Compound I-...)
Show SMILES CC(=O)Nc1cc(ccn1)-c1cnc(N)c(c1)S(=O)(=O)N1CCCCC1
Show InChI InChI=1S/C17H21N5O3S/c1-12(23)21-16-10-13(5-6-19-16)14-9-15(17(18)20-11-14)26(24,25)22-7-3-2-4-8-22/h5-6,9-11H,2-4,7-8H2,1H3,(H2,18,20)(H,19,21,23)
Reactome pathway
US Patent
n/an/a<10n/an/an/an/an/an/a
Millennium Pharmaceuticals, Inc.
US Patent
Assay Description
100 nL compounds in DMSO are added to wells of a 384 well microtitre plate (Greiner 780076). At room temperature: 5 ul VPS34 reaction buffer (Invitro...
US Patent US9751854 (2017)
BindingDB Entry DOI: 10.7270/Q2KS6TNJ