BDBM33825 (5-amino-3-pyridin-3-yl-1,2,4-triazol-1-yl)-(2-chlorophenyl)methanone::(5-azanyl-3-pyridin-3-yl-1,2,4-triazol-1-yl)-(2-chlorophenyl)methanone::1-(2-chlorobenzoyl)-3-(3-pyridinyl)-1H-1,2,4-triazol-5-amine::MLS000666413::SMR000294242::[5-amino-3-(3-pyridinyl)-1,2,4-triazol-1-yl]-(2-chlorophenyl)methanone::[5-amino-3-(3-pyridyl)-1,2,4-triazol-1-yl]-(2-chlorophenyl)methanone::cid_970713
SMILES: Nc1nc(nn1C(=O)c1ccccc1Cl)-c1cccnc1
InChI Key: InChIKey=UHIWVKZCJPLNNG-UHFFFAOYSA-N
Data: 2 IC50
Activity Spreadsheet -- Enzyme Inhibition Constant Data from BindingDB
Found 2 hits for monomerid = 33825
Trg + Lig
Ki
nM
ΔG°
kcal/mole
IC50
nM
Kd
nM
EC50/IC50
nM
koff
s-1
kon
M-1s-1
pHTemp
°C
Factor XIIa
(Homo sapiens (Human))
BDBM33825
((5-amino-3-pyridin-3-yl-1,2,4-triazol-1-yl)-(2-chl...)
Show SMILES Nc1nc(nn1C(=O)c1ccccc1Cl)-c1cccnc1
Show InChI InChI=1S/C14H10ClN5O/c15-11-6-2-1-5-10(11)13(21)20-14(16)18-12(19-20)9-4-3-7-17-8-9/h1-8H,(H2,16,18,19)
PCBioAssay
n/an/a 89.9n/an/an/an/an/an/a
PCMD
Curated by PubChem BioAssay
Assay Description
Molecular Library Screening Center Network (MLSCN) Penn Center for Molecular Discovery (PCMD) Assay Provider: Scott L. Diamond, University of Pennsy...
PubChem Bioassay (2008)
BindingDB Entry DOI: 10.7270/Q21G0JQS
Prothrombin
(Homo sapiens (Human))
BDBM33825
((5-amino-3-pyridin-3-yl-1,2,4-triazol-1-yl)-(2-chl...)
Show SMILES Nc1nc(nn1C(=O)c1ccccc1Cl)-c1cccnc1
Show InChI InChI=1S/C14H10ClN5O/c15-11-6-2-1-5-10(11)13(21)20-14(16)18-12(19-20)9-4-3-7-17-8-9/h1-8H,(H2,16,18,19)
PCBioAssay
n/an/a 83.1n/an/an/an/a7.523
PCMD
Curated by PubChem BioAssay
Assay Description
HTS was performed using 217,350 compounds of the MLSCN library individually plated into 10ul 1536 compound plates at a concentration of 2.5 mM each, ...
PubChem Bioassay (2008)
BindingDB Entry DOI: 10.7270/Q2K64GDN