null
SMILES: CC1CCC(c2ccccc2)S(=O)(=O)N1Cc1cc(F)c(cc1F)N1CC2CC1CC2n1cnnc1
InChI Key: InChIKey=LDVCUQRTQNORBZ-UHFFFAOYSA-N
Activity Spreadsheet -- Enzyme Inhibition Constant Data from BindingDB
Found 2 hits for monomerid = 338393
Trg + Lig
Ki
nM
ΔG°
kcal/mole
IC50
nM
Kd
nM
EC50/IC50
nM
koff
s-1
kon
M-1s-1
pHTemp
°C
Nuclear receptor ROR-gamma
(Homo sapiens (Human))
BDBM338393
(2-(4-((5R)-5-(4H-1,2,4-triazol-4- yl)-2-azabicyclo...)
Show SMILES CC1CCC(c2ccccc2)S(=O)(=O)N1Cc1cc(F)c(cc1F)N1CC2CC1CC2n1cnnc1
Show InChI InChI=1S/C26H29F2N5O2S/c1-17-7-8-26(18-5-3-2-4-6-18)36(34,35)33(17)14-19-10-23(28)25(12-22(19)27)32-13-20-9-21(32)11-24(20)31-15-29-30-16-31/h2-6,10,12,15-17,20-21,24,26H,7-9,11,13-14H2,1H3
US Patent
n/an/a 11n/an/an/an/an/an/a
Genentech, Inc.
US Patent
Assay Description
Assays were carried out in 16-microL reaction volumes in black 384 Plus F Proxiplates (Perkin-Elmer 6008269). All assay components except test ligand...
US Patent US9751873 (2017)
BindingDB Entry DOI: 10.7270/Q2BC41NZ
Nuclear receptor ROR-gamma
(Homo sapiens (Human))
BDBM338393
(2-(4-((5R)-5-(4H-1,2,4-triazol-4- yl)-2-azabicyclo...)
Show SMILES CC1CCC(c2ccccc2)S(=O)(=O)N1Cc1cc(F)c(cc1F)N1CC2CC1CC2n1cnnc1
Show InChI InChI=1S/C26H29F2N5O2S/c1-17-7-8-26(18-5-3-2-4-6-18)36(34,35)33(17)14-19-10-23(28)25(12-22(19)27)32-13-20-9-21(32)11-24(20)31-15-29-30-16-31/h2-6,10,12,15-17,20-21,24,26H,7-9,11,13-14H2,1H3
US Patent
n/an/a 15n/an/an/an/an/an/a
Genentech, Inc.
US Patent
Assay Description
Assays were carried out in 16-microL reaction volumes in black 384 Plus F Proxiplates (Perkin-Elmer 6008269). All assay components except test ligand...
US Patent US9751873 (2017)
BindingDB Entry DOI: 10.7270/Q2BC41NZ