BDBM33856 MLS000708243::SMR000287710::[5-amino-3-(2-furanyl)-1,2,4-triazol-1-yl]-(2-chlorophenyl)methanone::[5-amino-3-(2-furyl)-1,2,4-triazol-1-yl]-(2-chlorophenyl)methanone::[5-amino-3-(furan-2-yl)-1,2,4-triazol-1-yl]-(2-chlorophenyl)methanone::[5-azanyl-3-(furan-2-yl)-1,2,4-triazol-1-yl]-(2-chlorophenyl)methanone::cid_828593
SMILES: Nc1nc(nn1C(=O)c1ccccc1Cl)-c1ccco1
InChI Key: InChIKey=JARMYDUXNQNRAF-UHFFFAOYSA-N
Data: 2 IC50
Activity Spreadsheet -- Enzyme Inhibition Constant Data from BindingDB
Found 2 hits for monomerid = 33856
Trg + Lig
Ki
nM
ΔG°
kcal/mole
IC50
nM
Kd
nM
EC50/IC50
nM
koff
s-1
kon
M-1s-1
pHTemp
°C
Factor XIIa
(Homo sapiens (Human))
BDBM33856
(MLS000708243 | SMR000287710 | [5-amino-3-(2-furany...)
Show SMILES Nc1nc(nn1C(=O)c1ccccc1Cl)-c1ccco1
Show InChI InChI=1S/C13H9ClN4O2/c14-9-5-2-1-4-8(9)12(19)18-13(15)16-11(17-18)10-6-3-7-20-10/h1-7H,(H2,15,16,17)
PCBioAssay
n/an/a 238n/an/an/an/an/an/a
PCMD
Curated by PubChem BioAssay
Assay Description
Molecular Library Screening Center Network (MLSCN) Penn Center for Molecular Discovery (PCMD) Assay Provider: Scott L. Diamond, University of Pennsy...
PubChem Bioassay (2008)
BindingDB Entry DOI: 10.7270/Q21G0JQS
Prothrombin
(Homo sapiens (Human))
BDBM33856
(MLS000708243 | SMR000287710 | [5-amino-3-(2-furany...)
Show SMILES Nc1nc(nn1C(=O)c1ccccc1Cl)-c1ccco1
Show InChI InChI=1S/C13H9ClN4O2/c14-9-5-2-1-4-8(9)12(19)18-13(15)16-11(17-18)10-6-3-7-20-10/h1-7H,(H2,15,16,17)
PCBioAssay
n/an/a 1.40E+4n/an/an/an/a7.523
PCMD
Curated by PubChem BioAssay
Assay Description
HTS was performed using 217,350 compounds of the MLSCN library individually plated into 10ul 1536 compound plates at a concentration of 2.5 mM each, ...
PubChem Bioassay (2008)
BindingDB Entry DOI: 10.7270/Q2K64GDN