BDBM339829 US9757364, Compound 29
SMILES: COc1cc(OC)c(F)c(c1)N(CCNC(C)C)c1ccc2ncc(cc2n1)-c1cnn(C)c1
InChI Key: InChIKey=PFTPAJNMFJOUIG-UHFFFAOYSA-N
Data: 5 IC50
Activity Spreadsheet -- Enzyme Inhibition Constant Data from BindingDB
Found 5 hits for monomerid = 339829
Trg + Lig
Ki
nM
ΔG°
kcal/mole
IC50
nM
Kd
nM
EC50/IC50
nM
koff
s-1
kon
M-1s-1
pHTemp
°C
Fibroblast growth factor receptor 1
(Homo sapiens (Human))
BDBM339829
(US9757364, Compound 29)
Show SMILES COc1cc(OC)c(F)c(c1)N(CCNC(C)C)c1ccc2ncc(cc2n1)-c1cnn(C)c1
Show InChI InChI=1S/C25H29FN6O2/c1-16(2)27-8-9-32(22-11-19(33-4)12-23(34-5)25(22)26)24-7-6-20-21(30-24)10-17(13-28-20)18-14-29-31(3)15-18/h6-7,10-16,27H,8-9H2,1-5H3
NCI pathway
Reactome pathway
US Patent
n/an/a 1.10n/an/an/an/an/an/a
ASTEX THERAPEUTICS LTD
US Patent
Assay Description
In a final reaction volume of 30 μL, FGFR1 (h) (25 ng/ml) was incubated with 50 mM HEPES pH 7.5, 6 mM MnCl2, 1 mM DTT, 0.1 mM Na3VO4, 0.01% Trit...
US Patent US9757364 (2017)
BindingDB Entry DOI: 10.7270/Q2SB47VT
Fibroblast growth factor receptor 2
(Homo sapiens (Human))
BDBM339829
(US9757364, Compound 29)
Show SMILES COc1cc(OC)c(F)c(c1)N(CCNC(C)C)c1ccc2ncc(cc2n1)-c1cnn(C)c1
Show InChI InChI=1S/C25H29FN6O2/c1-16(2)27-8-9-32(22-11-19(33-4)12-23(34-5)25(22)26)24-7-6-20-21(30-24)10-17(13-28-20)18-14-29-31(3)15-18/h6-7,10-16,27H,8-9H2,1-5H3
NCI pathway
Reactome pathway
US Patent
n/an/a 3.39n/an/an/an/an/an/a
ASTEX THERAPEUTICS LTD
US Patent
Assay Description
In a final reaction volume of 30 μL, FGFR2 (h) (150 ng/ml) was incubated with 50 mM HEPES pH 7.5, 6 mM MnCl2, 1 mM DTT, 0.1 mM Na3VO4, 0.01% Tri...
US Patent US9757364 (2017)
BindingDB Entry DOI: 10.7270/Q2SB47VT
Vascular endothelial growth factor receptor 2
(Homo sapiens (Human))
BDBM339829
(US9757364, Compound 29)
Show SMILES COc1cc(OC)c(F)c(c1)N(CCNC(C)C)c1ccc2ncc(cc2n1)-c1cnn(C)c1
Show InChI InChI=1S/C25H29FN6O2/c1-16(2)27-8-9-32(22-11-19(33-4)12-23(34-5)25(22)26)24-7-6-20-21(30-24)10-17(13-28-20)18-14-29-31(3)15-18/h6-7,10-16,27H,8-9H2,1-5H3
NCI pathway
Reactome pathway
US Patent
n/an/a 19.1n/an/an/an/an/an/a
ASTEX THERAPEUTICS LTD
US Patent
Assay Description
In a final reaction volume of 30 μL, KDR (h) (150 ng/ml) was incubated with 50 mM HEPES pH 7.5, 6 mM MnCl2, 1 mM DTT, 0.1 mM Na3VO4, 0.01% Trito...
US Patent US9757364 (2017)
BindingDB Entry DOI: 10.7270/Q2SB47VT
Fibroblast growth factor receptor 4
(Homo sapiens (Human))
BDBM339829
(US9757364, Compound 29)
Show SMILES COc1cc(OC)c(F)c(c1)N(CCNC(C)C)c1ccc2ncc(cc2n1)-c1cnn(C)c1
Show InChI InChI=1S/C25H29FN6O2/c1-16(2)27-8-9-32(22-11-19(33-4)12-23(34-5)25(22)26)24-7-6-20-21(30-24)10-17(13-28-20)18-14-29-31(3)15-18/h6-7,10-16,27H,8-9H2,1-5H3
US Patent
n/an/a 4.57n/an/an/an/an/an/a
ASTEX THERAPEUTICS LTD
US Patent
Assay Description
In a final reaction volume of 30 μL, FGFR4 (h) (60 ng/ml) was incubated with 50 mM HEPES pH 7.5, 6 mM MnCl2, 1 mM DTT, 0.1 mM Na3VO4, 0.01% Trit...
US Patent US9757364 (2017)
BindingDB Entry DOI: 10.7270/Q2SB47VT
Fibroblast growth factor receptor 3
(Homo sapiens (Human))
BDBM339829
(US9757364, Compound 29)
Show SMILES COc1cc(OC)c(F)c(c1)N(CCNC(C)C)c1ccc2ncc(cc2n1)-c1cnn(C)c1
Show InChI InChI=1S/C25H29FN6O2/c1-16(2)27-8-9-32(22-11-19(33-4)12-23(34-5)25(22)26)24-7-6-20-21(30-24)10-17(13-28-20)18-14-29-31(3)15-18/h6-7,10-16,27H,8-9H2,1-5H3
Reactome pathway
US Patent
n/an/a 3.80n/an/an/an/an/an/a
ASTEX THERAPEUTICS LTD
US Patent
Assay Description
In a final reaction volume of 30 μL, FGFR3 (h) (40 ng/ml) was incubated with 50 mM HEPES pH 7.5, 6 mM MnCl2, 1 mM DTT, 0.1 mM Na3VO4, 0.01% Trit...
US Patent US9757364 (2017)
BindingDB Entry DOI: 10.7270/Q2SB47VT