BDBM34043 iodinated benzimidazole, 6a
SMILES: Brc1c(I)c(Br)c2nc[nH]c2c1I
InChI Key: InChIKey=XTTIKFSBEVVGCT-UHFFFAOYSA-N
Data: 1 KI
Activity Spreadsheet -- Enzyme Inhibition Constant Data from BindingDB
Found 1 hit for monomerid = 34043
Trg + Lig
Ki
nM
ΔG°
kcal/mole
IC50
nM
Kd
nM
EC50/IC50
nM
koff
s-1
kon
M-1s-1
pHTemp
°C
Casein kinase II subunit alpha
(Rattus norvegicus (Rat))
BDBM34043
(iodinated benzimidazole, 6a)
Show SMILES Brc1c(I)c(Br)c2nc[nH]c2c1I
Show InChI InChI=1S/C7H2Br2I2N2/c8-2-4(10)3(9)6-7(5(2)11)13-1-12-6/h1H,(H,12,13)
Reactome pathway
75 -10.1n/an/an/an/an/a7.537
University of Padova
Assay Description
Inhibitory effect of test compound was assessed in reaction buffer containing purified CK2, synthetic peptide substrate, and [gamma-33P]ATP. Assays w...
Bioorg Med Chem 17: 7281-9 (2009)
Article DOI: 10.1016/j.bmc.2009.08.047
BindingDB Entry DOI: 10.7270/Q2NZ860P