BDBM340507 US9763922, Example 38
SMILES: CC(=O)N1CCc2c(C1)c(Nc1ccc(F)c(c1)-c1cnn(C)c1)nn2CC1CC1
InChI Key: InChIKey=GTJSEQGNGCMLOB-UHFFFAOYSA-N
Data: 2 IC50
Activity Spreadsheet -- Enzyme Inhibition Constant Data from BindingDB
Found 2 hits for monomerid = 340507
Trg + Lig
Ki
nM
ΔG°
kcal/mole
IC50
nM
Kd
nM
EC50/IC50
nM
koff
s-1
kon
M-1s-1
pHTemp
°C
Bromodomain-containing protein 4
(Homo sapiens (Human))
BDBM340507
(US9763922, Example 38)
Show SMILES CC(=O)N1CCc2c(C1)c(Nc1ccc(F)c(c1)-c1cnn(C)c1)nn2CC1CC1
Show InChI InChI=1S/C22H25FN6O/c1-14(30)28-8-7-21-19(13-28)22(26-29(21)11-15-3-4-15)25-17-5-6-20(23)18(9-17)16-10-24-27(2)12-16/h5-6,9-10,12,15H,3-4,7-8,11,13H2,1-2H3,(H,25,26)
US Patent
n/an/a 2.52E+3n/an/an/an/an/an/a
GENENTECH, INC.; CONSTELLATION PHARMACEUTICALS, INC.
US Patent
Assay Description
His/Flag epitope tagged BRD4 BD142-168 was cloned, expressed, and purified to. BRD4 binding and inhibition was assessed by monitoring the engagement ...
US Patent US9763922 (2017)
BindingDB Entry DOI: 10.7270/Q23N25G6
CREB-binding protein
(Homo sapiens (Human))
BDBM340507
(US9763922, Example 38)
Show SMILES CC(=O)N1CCc2c(C1)c(Nc1ccc(F)c(c1)-c1cnn(C)c1)nn2CC1CC1
Show InChI InChI=1S/C22H25FN6O/c1-14(30)28-8-7-21-19(13-28)22(26-29(21)11-15-3-4-15)25-17-5-6-20(23)18(9-17)16-10-24-27(2)12-16/h5-6,9-10,12,15H,3-4,7-8,11,13H2,1-2H3,(H,25,26)
Reactome pathway
US Patent
n/an/a 10n/an/an/an/an/an/a
GENENTECH, INC.; CONSTELLATION PHARMACEUTICALS, INC.
US Patent
Assay Description
His/Flag epitope tagged CBP was cloned, expressed, and purified to homogeneity. CBP binding and inhibition was assessed by monitoring the engagement ...
US Patent US9763922 (2017)
BindingDB Entry DOI: 10.7270/Q23N25G6