BDBM340526 US9763922, Example 57
SMILES: CN\C=C(/C(=N)C(F)(F)F)c1ccc(NC(=N)C2=C(CCN(C2)C(C)=O)NC2CCOC2)cn1
InChI Key: InChIKey=RIHTXJCMDDEMDB-CXPHBSEKSA-N
Data: 2 IC50
Activity Spreadsheet -- Enzyme Inhibition Constant Data from BindingDB
Found 2 hits for monomerid = 340526
Trg + Lig
Ki
nM
ΔG°
kcal/mole
IC50
nM
Kd
nM
EC50/IC50
nM
koff
s-1
kon
M-1s-1
pHTemp
°C
Bromodomain-containing protein 4
(Homo sapiens (Human))
BDBM340526
(US9763922, Example 57)
Show SMILES CN\C=C(/C(=N)C(F)(F)F)c1ccc(NC(=N)C2=C(CCN(C2)C(C)=O)NC2CCOC2)cn1 |t:17|
Show InChI InChI=1S/C22H28F3N7O2/c1-13(33)32-7-5-19(30-15-6-8-34-12-15)17(11-32)21(27)31-14-3-4-18(29-9-14)16(10-28-2)20(26)22(23,24)25/h3-4,9-10,15,26,28,30H,5-8,11-12H2,1-2H3,(H2,27,31)/b16-10-,26-20?
US Patent
n/an/a 2.49E+3n/an/an/an/an/an/a
GENENTECH, INC.; CONSTELLATION PHARMACEUTICALS, INC.
US Patent
Assay Description
His/Flag epitope tagged BRD4 BD142-168 was cloned, expressed, and purified to. BRD4 binding and inhibition was assessed by monitoring the engagement ...
US Patent US9763922 (2017)
BindingDB Entry DOI: 10.7270/Q23N25G6
CREB-binding protein
(Homo sapiens (Human))
BDBM340526
(US9763922, Example 57)
Show SMILES CN\C=C(/C(=N)C(F)(F)F)c1ccc(NC(=N)C2=C(CCN(C2)C(C)=O)NC2CCOC2)cn1 |t:17|
Show InChI InChI=1S/C22H28F3N7O2/c1-13(33)32-7-5-19(30-15-6-8-34-12-15)17(11-32)21(27)31-14-3-4-18(29-9-14)16(10-28-2)20(26)22(23,24)25/h3-4,9-10,15,26,28,30H,5-8,11-12H2,1-2H3,(H2,27,31)/b16-10-,26-20?
Reactome pathway
US Patent
n/an/a 10n/an/an/an/an/an/a
GENENTECH, INC.; CONSTELLATION PHARMACEUTICALS, INC.
US Patent
Assay Description
His/Flag epitope tagged CBP was cloned, expressed, and purified to homogeneity. CBP binding and inhibition was assessed by monitoring the engagement ...
US Patent US9763922 (2017)
BindingDB Entry DOI: 10.7270/Q23N25G6