null
SMILES: NCCCCC(Oc1ccc(OC(F)(F)F)cc1)c1ccccc1
InChI Key: InChIKey=AIYPIAWMPHBKQI-UHFFFAOYSA-N
Activity Spreadsheet -- Enzyme Inhibition Constant Data from BindingDB
Found 2 hits for monomerid = 340542
Trg + Lig
Ki
nM
ΔG°
kcal/mole
IC50
nM
Kd
nM
EC50/IC50
nM
koff
s-1
kon
M-1s-1
pHTemp
°C
Large neutral amino acids transporter small subunit 2
(Homo sapiens (Human))
BDBM340542
(US9771316, Example 44)
Show SMILES NCCCCC(Oc1ccc(OC(F)(F)F)cc1)c1ccccc1
Show InChI InChI=1S/C18H20F3NO2/c19-18(20,21)24-16-11-9-15(10-12-16)23-17(8-4-5-13-22)14-6-2-1-3-7-14/h1-3,6-7,9-12,17H,4-5,8,13,22H2
NCI pathway
Reactome pathway
US Patent
n/an/a 1.69E+5n/an/an/an/an/an/a
Osaka University; KNC Laboratories Co., Ltd.
US Patent
US Patent US9771316 (2017)
BindingDB Entry DOI: 10.7270/Q2X0694S
Large neutral amino acids transporter small subunit 1
(Homo sapiens (Human))
BDBM340542
(US9771316, Example 44)
Show SMILES NCCCCC(Oc1ccc(OC(F)(F)F)cc1)c1ccccc1
Show InChI InChI=1S/C18H20F3NO2/c19-18(20,21)24-16-11-9-15(10-12-16)23-17(8-4-5-13-22)14-6-2-1-3-7-14/h1-3,6-7,9-12,17H,4-5,8,13,22H2
US Patent
n/an/a 3.94E+4n/an/an/an/an/an/a
Osaka University; KNC Laboratories Co., Ltd.
US Patent
Assay Description
Expression vector each expressing a gene was inserted using Lipofectamine 2000 (Invitrogen) to cultured cell line HEK293 cell derived from human fetu...
US Patent US9771316 (2017)
BindingDB Entry DOI: 10.7270/Q2X0694S