BDBM34069 NSC 177940
SMILES: [#6]-[#6](=[#7]\[#7]=[#6](/[#7])-[#7])-c1ccc(-[#7]-[#6](=S)-[#7]-c2ccccc2)cc1
InChI Key: InChIKey=AWTKMPYJPASKGD-UHFFFAOYSA-N
Data: 1 IC50
Activity Spreadsheet -- Enzyme Inhibition Constant Data from BindingDB
Found 1 hit for monomerid = 34069
Trg + Lig
Ki
nM
ΔG°
kcal/mole
IC50
nM
Kd
nM
EC50/IC50
nM
koff
s-1
kon
M-1s-1
pHTemp
°C
Serine/threonine-protein kinase Chk2 [209-531,Q209M]
(Homo sapiens (Human))
BDBM34069
(NSC 177940)
Show SMILES [#6]-[#6](=[#7]\[#7]=[#6](/[#7])-[#7])-c1ccc(-[#7]-[#6](=S)-[#7]-c2ccccc2)cc1 |w:2.2|
Show InChI InChI=1S/C16H18N6S/c1-11(21-22-15(17)18)12-7-9-14(10-8-12)20-16(23)19-13-5-3-2-4-6-13/h2-10H,1H3,(H4,17,18,22)(H2,19,20,23)
NCI pathway
Reactome pathway
n/an/a>2.00E+4n/an/an/an/a7.223
NIH
Assay Description
The IMAP Screening Express Kit (Molecular Devices, Sunnyvale, CA) was used for the high-throughput screening experiments. Compounds from the Developm...
Mol Pharmacol 72: 876-84 (2007)
Article DOI: 10.1124/mol.107.035832
BindingDB Entry DOI: 10.7270/Q2J67F9Q
3D
3D Structure (docked)