BDBM340745 US9763922, Example 271
SMILES: CNC(=O)N1CCc2c(C1)c(Nc1cc(cc(c1)S(=O)(=O)N(C)C)-c1cnn(C)c1)nn2C1CCOCC1
InChI Key: InChIKey=KAGCTOAAEVOQPX-UHFFFAOYSA-N
Data: 2 IC50
Activity Spreadsheet -- Enzyme Inhibition Constant Data from BindingDB
Found 2 hits for monomerid = 340745
Trg + Lig
Ki
nM
ΔG°
kcal/mole
IC50
nM
Kd
nM
EC50/IC50
nM
koff
s-1
kon
M-1s-1
pHTemp
°C
Bromodomain-containing protein 4
(Homo sapiens (Human))
BDBM340745
(US9763922, Example 271)
Show SMILES CNC(=O)N1CCc2c(C1)c(Nc1cc(cc(c1)S(=O)(=O)N(C)C)-c1cnn(C)c1)nn2C1CCOCC1
Show InChI InChI=1S/C25H34N8O4S/c1-26-25(34)32-8-5-23-22(16-32)24(29-33(23)20-6-9-37-10-7-20)28-19-11-17(18-14-27-31(4)15-18)12-21(13-19)38(35,36)30(2)3/h11-15,20H,5-10,16H2,1-4H3,(H,26,34)(H,28,29)
US Patent
n/an/a 7.07E+3n/an/an/an/an/an/a
GENENTECH, INC.; CONSTELLATION PHARMACEUTICALS, INC.
US Patent
Assay Description
His/Flag epitope tagged BRD4 BD142-168 was cloned, expressed, and purified to. BRD4 binding and inhibition was assessed by monitoring the engagement ...
US Patent US9763922 (2017)
BindingDB Entry DOI: 10.7270/Q23N25G6
CREB-binding protein
(Homo sapiens (Human))
BDBM340745
(US9763922, Example 271)
Show SMILES CNC(=O)N1CCc2c(C1)c(Nc1cc(cc(c1)S(=O)(=O)N(C)C)-c1cnn(C)c1)nn2C1CCOCC1
Show InChI InChI=1S/C25H34N8O4S/c1-26-25(34)32-8-5-23-22(16-32)24(29-33(23)20-6-9-37-10-7-20)28-19-11-17(18-14-27-31(4)15-18)12-21(13-19)38(35,36)30(2)3/h11-15,20H,5-10,16H2,1-4H3,(H,26,34)(H,28,29)
Reactome pathway
US Patent
n/an/a 3n/an/an/an/an/an/a
GENENTECH, INC.; CONSTELLATION PHARMACEUTICALS, INC.
US Patent
Assay Description
His/Flag epitope tagged CBP was cloned, expressed, and purified to homogeneity. CBP binding and inhibition was assessed by monitoring the engagement ...
US Patent US9763922 (2017)
BindingDB Entry DOI: 10.7270/Q23N25G6