BDBM340748 US9763922, Example 274
SMILES: CNC(=O)N1CCc2c(C1)c(Nc1cc(C(F)F)c(cc1F)-c1cnn(C)c1)nn2C1CCN(CC1)C(C)=O
InChI Key: InChIKey=QARXDGYJCSXZCM-UHFFFAOYSA-N
Data: 2 IC50
Activity Spreadsheet -- Enzyme Inhibition Constant Data from BindingDB
Found 2 hits for monomerid = 340748
Trg + Lig
Ki
nM
ΔG°
kcal/mole
IC50
nM
Kd
nM
EC50/IC50
nM
koff
s-1
kon
M-1s-1
pHTemp
°C
Bromodomain-containing protein 4
(Homo sapiens (Human))
BDBM340748
(US9763922, Example 274)
Show SMILES CNC(=O)N1CCc2c(C1)c(Nc1cc(C(F)F)c(cc1F)-c1cnn(C)c1)nn2C1CCN(CC1)C(C)=O
Show InChI InChI=1S/C26H31F3N8O2/c1-15(38)35-7-4-17(5-8-35)37-23-6-9-36(26(39)30-2)14-20(23)25(33-37)32-22-11-19(24(28)29)18(10-21(22)27)16-12-31-34(3)13-16/h10-13,17,24H,4-9,14H2,1-3H3,(H,30,39)(H,32,33)
US Patent
n/an/a 8.86E+3n/an/an/an/an/an/a
GENENTECH, INC.; CONSTELLATION PHARMACEUTICALS, INC.
US Patent
Assay Description
His/Flag epitope tagged BRD4 BD142-168 was cloned, expressed, and purified to. BRD4 binding and inhibition was assessed by monitoring the engagement ...
US Patent US9763922 (2017)
BindingDB Entry DOI: 10.7270/Q23N25G6
CREB-binding protein
(Homo sapiens (Human))
BDBM340748
(US9763922, Example 274)
Show SMILES CNC(=O)N1CCc2c(C1)c(Nc1cc(C(F)F)c(cc1F)-c1cnn(C)c1)nn2C1CCN(CC1)C(C)=O
Show InChI InChI=1S/C26H31F3N8O2/c1-15(38)35-7-4-17(5-8-35)37-23-6-9-36(26(39)30-2)14-20(23)25(33-37)32-22-11-19(24(28)29)18(10-21(22)27)16-12-31-34(3)13-16/h10-13,17,24H,4-9,14H2,1-3H3,(H,30,39)(H,32,33)
Reactome pathway
US Patent
n/an/a 1n/an/an/an/an/an/a
GENENTECH, INC.; CONSTELLATION PHARMACEUTICALS, INC.
US Patent
Assay Description
His/Flag epitope tagged CBP was cloned, expressed, and purified to homogeneity. CBP binding and inhibition was assessed by monitoring the engagement ...
US Patent US9763922 (2017)
BindingDB Entry DOI: 10.7270/Q23N25G6