BDBM340946 3-tert-butyl-1-(6-methoxynaphthalen-2- yl)imidazo[1,5-a]pyrazin-8-amine::US10544104, Compound 71::US9765037, Compound 71
SMILES: COc1ccc2cc(ccc2c1)-c1nc(n2ccnc(N)c12)C(C)(C)C
InChI Key: InChIKey=WZGZBUFREKYIRA-UHFFFAOYSA-N
Data: 6 IC50
Activity Spreadsheet -- Enzyme Inhibition Constant Data from BindingDB
Found 6 hits for monomerid = 340946
Trg + Lig
Ki
nM
ΔG°
kcal/mole
IC50
nM
Kd
nM
EC50/IC50
nM
koff
s-1
kon
M-1s-1
pHTemp
°C
Calmodulin-domain protein kinase 1 (CDPK1)
(Toxoplasma gondii)
BDBM340946
(3-tert-butyl-1-(6-methoxynaphthalen-2- yl)imidazo[...)
Show SMILES COc1ccc2cc(ccc2c1)-c1nc(n2ccnc(N)c12)C(C)(C)C
Show InChI InChI=1S/C21H22N4O/c1-21(2,3)20-24-17(18-19(22)23-9-10-25(18)20)15-6-5-14-12-16(26-4)8-7-13(14)11-15/h5-12H,1-4H3,(H2,22,23)
US Patent
n/an/a 4.90n/an/an/an/an/an/a
University of Washington Through its Center for Commercialization
US Patent
Assay Description
Most known kinase inhibitors bind in the ATP-binding pocket of the active site19,20. These inhibitors exploit many of the same hydrophobic contacts a...
US Patent US9765037 (2017)
BindingDB Entry DOI: 10.7270/Q2B56MVC
Calcium-dependent protein kinase 1 (CDPK1)
(Cryptosporidium parvum)
BDBM340946
(3-tert-butyl-1-(6-methoxynaphthalen-2- yl)imidazo[...)
Show SMILES COc1ccc2cc(ccc2c1)-c1nc(n2ccnc(N)c12)C(C)(C)C
Show InChI InChI=1S/C21H22N4O/c1-21(2,3)20-24-17(18-19(22)23-9-10-25(18)20)15-6-5-14-12-16(26-4)8-7-13(14)11-15/h5-12H,1-4H3,(H2,22,23)
US Patent
n/an/a 5.30n/an/an/an/an/an/a
University of Washington Through its Center for Commercialization
US Patent
Assay Description
Two types of enzyme assays were developed to follow TgCDPK1 activity, a radiometric scintillation proximity assay measured the labeled γ-phospha...
US Patent US9765037 (2017)
BindingDB Entry DOI: 10.7270/Q2B56MVC
Tyrosine-protein kinase ABL1
(Homo sapiens (Human))
BDBM340946
(3-tert-butyl-1-(6-methoxynaphthalen-2- yl)imidazo[...)
Show SMILES COc1ccc2cc(ccc2c1)-c1nc(n2ccnc(N)c12)C(C)(C)C
Show InChI InChI=1S/C21H22N4O/c1-21(2,3)20-24-17(18-19(22)23-9-10-25(18)20)15-6-5-14-12-16(26-4)8-7-13(14)11-15/h5-12H,1-4H3,(H2,22,23)
Reactome pathway
US Patent
n/an/a>1.00E+4n/an/an/an/an/an/a
UNIVERSITY OF WASHINGTON THROUGH ITS CENTER FOR CO
US Patent
Assay Description
Inhibition of TgCDPK1 and CpCDPK1 was determined using a luminescent kinase assay which measures ATP depletion in the presence of the Syntide 2 pepti...
US Patent US10544104 (2020)
BindingDB Entry DOI: 10.7270/Q2D79DSF
Calmodulin-domain protein kinase 1, putative
(Cryptosporidium parvum (strain Iowa II))
BDBM340946
(3-tert-butyl-1-(6-methoxynaphthalen-2- yl)imidazo[...)
Show SMILES COc1ccc2cc(ccc2c1)-c1nc(n2ccnc(N)c12)C(C)(C)C
Show InChI InChI=1S/C21H22N4O/c1-21(2,3)20-24-17(18-19(22)23-9-10-25(18)20)15-6-5-14-12-16(26-4)8-7-13(14)11-15/h5-12H,1-4H3,(H2,22,23)
US Patent
n/an/a 5.30n/an/an/an/an/an/a
UNIVERSITY OF WASHINGTON THROUGH ITS CENTER FOR CO
US Patent
Assay Description
Inhibition of TgCDPK1 and CpCDPK1 was determined using a luminescent kinase assay which measures ATP depletion in the presence of the Syntide 2 pepti...
US Patent US10544104 (2020)
BindingDB Entry DOI: 10.7270/Q2D79DSF
Calmodulin/Proto-oncogene tyrosine-protein kinase Src
(Homo sapiens (Human))
BDBM340946
(3-tert-butyl-1-(6-methoxynaphthalen-2- yl)imidazo[...)
Show SMILES COc1ccc2cc(ccc2c1)-c1nc(n2ccnc(N)c12)C(C)(C)C
Show InChI InChI=1S/C21H22N4O/c1-21(2,3)20-24-17(18-19(22)23-9-10-25(18)20)15-6-5-14-12-16(26-4)8-7-13(14)11-15/h5-12H,1-4H3,(H2,22,23)
US Patent
n/an/a 6.09E+3n/an/an/an/an/an/a
UNIVERSITY OF WASHINGTON THROUGH ITS CENTER FOR CO
US Patent
Assay Description
Inhibition of TgCDPK1 and CpCDPK1 was determined using a luminescent kinase assay which measures ATP depletion in the presence of the Syntide 2 pepti...
US Patent US10544104 (2020)
BindingDB Entry DOI: 10.7270/Q2D79DSF
Calmodulin-domain protein kinase 1
(Toxoplasma gondii)
BDBM340946
(3-tert-butyl-1-(6-methoxynaphthalen-2- yl)imidazo[...)
Show SMILES COc1ccc2cc(ccc2c1)-c1nc(n2ccnc(N)c12)C(C)(C)C
Show InChI InChI=1S/C21H22N4O/c1-21(2,3)20-24-17(18-19(22)23-9-10-25(18)20)15-6-5-14-12-16(26-4)8-7-13(14)11-15/h5-12H,1-4H3,(H2,22,23)
US Patent
n/an/a 4.90n/an/an/an/an/an/a
UNIVERSITY OF WASHINGTON THROUGH ITS CENTER FOR CO
US Patent
Assay Description
Inhibition of TgCDPK1 and CpCDPK1 was determined using a luminescent kinase assay which measures ATP depletion in the presence of the Syntide 2 pepti...
US Patent US10544104 (2020)
BindingDB Entry DOI: 10.7270/Q2D79DSF