BDBM34108 glucopyranosylidene-spiro-isoxazoline, 4c
SMILES: OC[C@H]1O[C@@]2(CC(=NO2)c2ccccc2)[C@H](O)[C@@H](O)[C@@H]1O
InChI Key: InChIKey=YLTDNVVQKRHCJP-RKQHYHRCSA-N
Data: 1 KI
PDB links: 1 PDB ID matches this monomer.
Activity Spreadsheet -- Enzyme Inhibition Constant Data from BindingDB
Found 1 hit for monomerid = 34108
Trg + Lig
Ki
nM
ΔG°
kcal/mole
IC50
nM
Kd
nM
EC50/IC50
nM
koff
s-1
kon
M-1s-1
pHTemp
°C
Glycogen Phosphorylase (PYGM)
(Oryctolagus cuniculus (rabbit))
BDBM34108
(glucopyranosylidene-spiro-isoxazoline, 4c)
Show SMILES OC[C@H]1O[C@@]2(CC(=NO2)c2ccccc2)[C@H](O)[C@@H](O)[C@@H]1O |c:6|
Show InChI InChI=1S/C14H17NO6/c16-7-10-11(17)12(18)13(19)14(20-10)6-9(15-21-14)8-4-2-1-3-5-8/h1-5,10-13,16-19H,6-7H2/t10-,11-,12+,13-,14-/m1/s1
1.96E+4 -6.53n/an/an/an/an/a6.830
Universite de Lyon
Assay Description
Phosphorylase activity was measured in the direction of glycogen synthesis by the release of orthophosphate from Glc-1-P. The enzyme was assayed in g...
Bioorg Med Chem 17: 7368-80 (2009)
Article DOI: 10.1016/j.bmc.2009.08.060
BindingDB Entry DOI: 10.7270/Q28P5XV8
3D
3D Structure (crystal)