null
SMILES: CCOc1cc(F)c(Cn2cc(N(C)C)c(n2)-c2ncc(OC)c(Nc3ccncc3)n2)c(F)c1
InChI Key: InChIKey=TYXHNCNKIXBYQD-UHFFFAOYSA-N
Activity Spreadsheet -- Enzyme Inhibition Constant Data from BindingDB
Found 1 hit for monomerid = 341161
Trg + Lig
Ki
nM
ΔG°
kcal/mole
IC50
nM
Kd
nM
EC50/IC50
nM
koff
s-1
kon
M-1s-1
pHTemp
°C
Mitotic checkpoint serine/threonine-protein kinase BUB1
(Homo sapiens (Human))
BDBM341161
(US9765058, Example 2-2-10)
Show SMILES CCOc1cc(F)c(Cn2cc(N(C)C)c(n2)-c2ncc(OC)c(Nc3ccncc3)n2)c(F)c1
Show InChI InChI=1S/C24H25F2N7O2/c1-5-35-16-10-18(25)17(19(26)11-16)13-33-14-20(32(2)3)22(31-33)24-28-12-21(34-4)23(30-24)29-15-6-8-27-9-7-15/h6-12,14H,5,13H2,1-4H3,(H,27,28,29,30)
Reactome pathway
US Patent
n/an/a 250n/an/an/an/an/an/a
Bayer Pharma Aktiengesellschaft
US Patent
Assay Description
In a typical assay 11 different concentrations of each compound (0.1 nM, 0.33 nM, 1.1 nM, 3.8 nM, 13 nM, 44 nM, 0.15 μM, 0.51 μM, 1.7 μ...
US Patent US9765058 (2017)
BindingDB Entry DOI: 10.7270/Q2JQ1347