BDBM34120 hydroquinone derivative, 6
SMILES: Oc1cc(CC=C)c(O)cc1CC=C
InChI Key: InChIKey=ZBWLFAIFBZLNJB-UHFFFAOYSA-N
Data: 1 IC50
Activity Spreadsheet -- Enzyme Inhibition Constant Data from BindingDB
Found 1 hit for monomerid = 34120
Trg + Lig
Ki
nM
ΔG°
kcal/mole
IC50
nM
Kd
nM
EC50/IC50
nM
koff
s-1
kon
M-1s-1
pHTemp
°C
Sarco/endoplasmic Reticulum Ca2+ ATPase 1
(Oryctolagus cuniculus)
BDBM34120
(hydroquinone derivative, 6)
Show SMILES Oc1cc(CC=C)c(O)cc1CC=C
Show InChI InChI=1S/C12H14O2/c1-3-5-9-7-12(14)10(6-4-2)8-11(9)13/h3-4,7-8,13-14H,1-2,5-6H2
n/an/a 6.00E+3n/an/an/an/a7.337
Northern Kentucky University
Assay Description
Inhibitory potencies of compounds were determined in a coupled ATPase activity assay using SERCA microsomes at 14 different inhibitor concentrations....
Bioorg Med Chem 17: 6613-9 (2009)
Article DOI: 10.1016/j.bmc.2009.07.075
BindingDB Entry DOI: 10.7270/Q2154FCG